creadur-dev mailing list archives

Site index · List index
Message view « Date » · « Thread »
Top « Date » · « Thread »
From Apache Jenkins Server <jenk...@builds.apache.org>
Subject Build failed in Jenkins: Creadur-Whisker #7
Date Fri, 22 Aug 2014 19:47:36 GMT
See <https://builds.apache.org/job/Creadur-Whisker/7/>

------------------------------------------
[...truncated 837 lines...]
Downloaded: http://repo.maven.apache.org/maven2/org/apache/maven/plugins/maven-shade-plugin/2.2/maven-shade-plugin-2.2.jar
(98 KB at 890.1 KB/sec)
[INFO] 
[INFO] --- maven-clean-plugin:2.5:clean (default-clean) @ apache-whisker-cli ---
[INFO] 
[INFO] --- apache-rat-plugin:0.10:check (default) @ apache-whisker-cli ---
[INFO] 51 implicit excludes (use -debug for more details).
[INFO] Exclude: dependency-reduced-pom.xml
[INFO] Exclude: src/main/resources/META-INF/jdom_LICENSE
[INFO] Exclude: src/main/resources/META-INF/jdom_NOTICE
[INFO] 12 resources included (use -debug for more details)
[INFO] Rat check: Summary of files. Unapproved: 0 unknown: 0 generated: 0 approved: 10 licence.
[INFO] 
[INFO] --- maven-remote-resources-plugin:1.5:process (default) @ apache-whisker-cli ---
[INFO] 
[INFO] --- maven-resources-plugin:2.6:resources (default-resources) @ apache-whisker-cli ---
[INFO] Using 'UTF-8' encoding to copy filtered resources.
[INFO] Copying 2 resources
[INFO] Copying 3 resources
[INFO] 
[INFO] --- maven-compiler-plugin:3.1:compile (default-compile) @ apache-whisker-cli ---
[INFO] Changes detected - recompiling the module!
[INFO] Compiling 4 source files to <https://builds.apache.org/job/Creadur-Whisker/ws/apache-whisker-cli/target/classes>
[INFO] 
[INFO] --- maven-resources-plugin:2.6:testResources (default-testResources) @ apache-whisker-cli
---
[INFO] Using 'UTF-8' encoding to copy filtered resources.
[INFO] skip non existing resourceDirectory <https://builds.apache.org/job/Creadur-Whisker/ws/apache-whisker-cli/src/test/resources>
[INFO] Copying 3 resources
[INFO] 
[INFO] --- maven-compiler-plugin:3.1:testCompile (default-testCompile) @ apache-whisker-cli
---
[INFO] Changes detected - recompiling the module!
[INFO] Compiling 2 source files to <https://builds.apache.org/job/Creadur-Whisker/ws/apache-whisker-cli/target/test-classes>
[INFO] 
[INFO] --- maven-surefire-plugin:2.16:test (default-test) @ apache-whisker-cli ---
[INFO] Surefire report directory: <https://builds.apache.org/job/Creadur-Whisker/ws/apache-whisker-cli/target/surefire-reports>

-------------------------------------------------------
 T E S T S
-------------------------------------------------------
Running org.apache.creadur.whisker.cli.TestCommandParsing
Tests run: 10, Failures: 0, Errors: 0, Skipped: 0, Time elapsed: 0.09 sec - in org.apache.creadur.whisker.cli.TestCommandParsing
Running org.apache.creadur.whisker.cli.TestMain
Tests run: 4, Failures: 0, Errors: 0, Skipped: 0, Time elapsed: 0 sec - in org.apache.creadur.whisker.cli.TestMain

Results :

Tests run: 14, Failures: 0, Errors: 0, Skipped: 0

[JENKINS] Recording test results
[INFO] 
[INFO] --- maven-jar-plugin:2.4:jar (default-jar) @ apache-whisker-cli ---
[INFO] Building jar: <https://builds.apache.org/job/Creadur-Whisker/ws/apache-whisker-cli/target/apache-whisker-0.2-SNAPSHOT.jar>
[INFO] 
[INFO] --- maven-site-plugin:3.4:attach-descriptor (attach-descriptor) @ apache-whisker-cli
---
[INFO] 
[INFO] --- maven-shade-plugin:2.2:shade (default) @ apache-whisker-cli ---
Downloading: http://repo.maven.apache.org/maven2/org/jdom/jdom/1.1/jdom-1.1.pom
Downloaded: http://repo.maven.apache.org/maven2/org/jdom/jdom/1.1/jdom-1.1.pom (0 B at 0.0
KB/sec)
Downloading: http://repo.maven.apache.org/maven2/asm/asm/3.2/asm-3.2.pom
Downloaded: http://repo.maven.apache.org/maven2/asm/asm/3.2/asm-3.2.pom (0 B at 0.0 KB/sec)
Downloading: http://repo.maven.apache.org/maven2/asm/asm-parent/3.2/asm-parent-3.2.pom
Downloaded: http://repo.maven.apache.org/maven2/asm/asm-parent/3.2/asm-parent-3.2.pom (0 B
at 0.0 KB/sec)
Downloading: http://repo.maven.apache.org/maven2/org/jdom/jdom/1.1/jdom-1.1.jar
Downloaded: http://repo.maven.apache.org/maven2/org/jdom/jdom/1.1/jdom-1.1.jar (0 B at 0.0
KB/sec)
[INFO] Including commons-logging:commons-logging-api:jar:1.1 in the shaded jar.
[INFO] Including commons-cli:commons-cli:jar:1.2 in the shaded jar.
[INFO] Including org.apache.creadur.whisker:apache-whisker-scan:jar:0.2-SNAPSHOT in the shaded
jar.
[INFO] Including org.apache.creadur.whisker:apache-whisker-xml:jar:0.2-SNAPSHOT in the shaded
jar.
[INFO] Including org.jdom:jdom:jar:1.1.3 in the shaded jar.
[INFO] Including org.apache.commons:commons-lang3:jar:3.3.2 in the shaded jar.
[INFO] Including org.apache.creadur.whisker:apache-whisker-model:jar:0.2-SNAPSHOT in the shaded
jar.
[INFO] Including org.apache.creadur.whisker:apache-whisker-velocity:jar:0.2-SNAPSHOT in the
shaded jar.
[INFO] Including org.apache.velocity:velocity:jar:1.7 in the shaded jar.
[INFO] Including commons-collections:commons-collections:jar:3.2.1 in the shaded jar.
[INFO] Including commons-lang:commons-lang:jar:2.4 in the shaded jar.
[INFO] Including commons-io:commons-io:jar:2.4 in the shaded jar.
[INFO] Including org.apache.creadur.whisker:apache-whisker-app:jar:0.2-SNAPSHOT in the shaded
jar.
[INFO] Replacing original artifact with shaded artifact.
[INFO] Replacing <https://builds.apache.org/job/Creadur-Whisker/ws/apache-whisker-cli/target/apache-whisker-0.2-SNAPSHOT.jar>
with <https://builds.apache.org/job/Creadur-Whisker/ws/apache-whisker-cli/target/apache-whisker-cli-0.2-SNAPSHOT-shaded.jar>
[INFO] Dependency-reduced POM written at: <https://builds.apache.org/job/Creadur-Whisker/ws/apache-whisker-cli/dependency-reduced-pom.xml>
[INFO] 
[INFO] --- maven-install-plugin:2.5.1:install (default-install) @ apache-whisker-cli ---
[INFO] Installing <https://builds.apache.org/job/Creadur-Whisker/ws/apache-whisker-cli/target/apache-whisker-0.2-SNAPSHOT.jar>
to /home/jenkins/jenkins-slave/maven-repositories/2/org/apache/creadur/whisker/apache-whisker-cli/0.2-SNAPSHOT/apache-whisker-cli-0.2-SNAPSHOT.jar
[INFO] Installing <https://builds.apache.org/job/Creadur-Whisker/ws/apache-whisker-cli/dependency-reduced-pom.xml>
to /home/jenkins/jenkins-slave/maven-repositories/2/org/apache/creadur/whisker/apache-whisker-cli/0.2-SNAPSHOT/apache-whisker-cli-0.2-SNAPSHOT.pom
[INFO]                                                                         
[INFO] ------------------------------------------------------------------------
[INFO] Building Apache Whisker::Plugin(Maven) 0.2-SNAPSHOT
[INFO] ------------------------------------------------------------------------
Downloading: http://repo.maven.apache.org/maven2/org/apache/maven/plugins/maven-invoker-plugin/1.8/maven-invoker-plugin-1.8.pom
Downloaded: http://repo.maven.apache.org/maven2/org/apache/maven/plugins/maven-invoker-plugin/1.8/maven-invoker-plugin-1.8.pom
(13 KB at 166.3 KB/sec)
Downloading: http://repo.maven.apache.org/maven2/org/apache/maven/plugins/maven-invoker-plugin/1.8/maven-invoker-plugin-1.8.jar
Downloaded: http://repo.maven.apache.org/maven2/org/apache/maven/plugins/maven-invoker-plugin/1.8/maven-invoker-plugin-1.8.jar
(103 KB at 918.5 KB/sec)
Downloading: http://repo.maven.apache.org/maven2/org/apache/maven/maven-plugin-api/3.2.2/maven-plugin-api-3.2.2.pom
Downloaded: http://repo.maven.apache.org/maven2/org/apache/maven/maven-plugin-api/3.2.2/maven-plugin-api-3.2.2.pom
(3 KB at 39.4 KB/sec)
Downloading: http://repo.maven.apache.org/maven2/org/apache/maven/maven/3.2.2/maven-3.2.2.pom
Downloaded: http://repo.maven.apache.org/maven2/org/apache/maven/maven/3.2.2/maven-3.2.2.pom
(23 KB at 299.6 KB/sec)
Downloading: http://repo.maven.apache.org/maven2/org/apache/maven/maven-model/3.2.2/maven-model-3.2.2.pom
Downloaded: http://repo.maven.apache.org/maven2/org/apache/maven/maven-model/3.2.2/maven-model-3.2.2.pom
(5 KB at 53.9 KB/sec)
Downloading: http://repo.maven.apache.org/maven2/org/codehaus/plexus/plexus-utils/3.0.17/plexus-utils-3.0.17.pom
Downloaded: http://repo.maven.apache.org/maven2/org/codehaus/plexus/plexus-utils/3.0.17/plexus-utils-3.0.17.pom
(4 KB at 44.8 KB/sec)
Downloading: http://repo.maven.apache.org/maven2/org/apache/maven/maven-artifact/3.2.2/maven-artifact-3.2.2.pom
Downloaded: http://repo.maven.apache.org/maven2/org/apache/maven/maven-artifact/3.2.2/maven-artifact-3.2.2.pom
(2 KB at 25.7 KB/sec)
Downloading: http://repo.maven.apache.org/maven2/org/eclipse/sisu/org.eclipse.sisu.plexus/0.0.0.M5/org.eclipse.sisu.plexus-0.0.0.M5.pom
Downloaded: http://repo.maven.apache.org/maven2/org/eclipse/sisu/org.eclipse.sisu.plexus/0.0.0.M5/org.eclipse.sisu.plexus-0.0.0.M5.pom
(5 KB at 55.5 KB/sec)
Downloading: http://repo.maven.apache.org/maven2/org/eclipse/sisu/sisu-plexus/0.0.0.M5/sisu-plexus-0.0.0.M5.pom
Downloaded: http://repo.maven.apache.org/maven2/org/eclipse/sisu/sisu-plexus/0.0.0.M5/sisu-plexus-0.0.0.M5.pom
(13 KB at 174.2 KB/sec)
Downloading: http://repo.maven.apache.org/maven2/org/eclipse/sisu/org.eclipse.sisu.inject/0.0.0.M5/org.eclipse.sisu.inject-0.0.0.M5.pom
Downloaded: http://repo.maven.apache.org/maven2/org/eclipse/sisu/org.eclipse.sisu.inject/0.0.0.M5/org.eclipse.sisu.inject-0.0.0.M5.pom
(3 KB at 32.8 KB/sec)
Downloading: http://repo.maven.apache.org/maven2/org/eclipse/sisu/sisu-inject/0.0.0.M5/sisu-inject-0.0.0.M5.pom
Downloaded: http://repo.maven.apache.org/maven2/org/eclipse/sisu/sisu-inject/0.0.0.M5/sisu-inject-0.0.0.M5.pom
(14 KB at 182.2 KB/sec)
Downloading: http://repo.maven.apache.org/maven2/org/apache/maven/maven-plugin-api/3.2.2/maven-plugin-api-3.2.2.jar
Downloading: http://repo.maven.apache.org/maven2/org/apache/maven/maven-model/3.2.2/maven-model-3.2.2.jar
Downloading: http://repo.maven.apache.org/maven2/org/codehaus/plexus/plexus-utils/3.0.17/plexus-utils-3.0.17.jar
Downloading: http://repo.maven.apache.org/maven2/org/apache/maven/maven-artifact/3.2.2/maven-artifact-3.2.2.jar
Downloading: http://repo.maven.apache.org/maven2/org/eclipse/sisu/org.eclipse.sisu.plexus/0.0.0.M5/org.eclipse.sisu.plexus-0.0.0.M5.jar
Downloaded: http://repo.maven.apache.org/maven2/org/apache/maven/maven-plugin-api/3.2.2/maven-plugin-api-3.2.2.jar
(45 KB at 588.0 KB/sec)
Downloading: http://repo.maven.apache.org/maven2/com/google/guava/guava/10.0.1/guava-10.0.1.jar
Downloaded: http://repo.maven.apache.org/maven2/org/apache/maven/maven-artifact/3.2.2/maven-artifact-3.2.2.jar
(53 KB at 325.9 KB/sec)
Downloading: http://repo.maven.apache.org/maven2/org/eclipse/sisu/org.eclipse.sisu.inject/0.0.0.M5/org.eclipse.sisu.inject-0.0.0.M5.jar
Downloaded: http://repo.maven.apache.org/maven2/org/apache/maven/maven-model/3.2.2/maven-model-3.2.2.jar
(157 KB at 664.3 KB/sec)
Downloaded: http://repo.maven.apache.org/maven2/org/eclipse/sisu/org.eclipse.sisu.plexus/0.0.0.M5/org.eclipse.sisu.plexus-0.0.0.M5.jar
(192 KB at 732.6 KB/sec)
Downloaded: http://repo.maven.apache.org/maven2/org/codehaus/plexus/plexus-utils/3.0.17/plexus-utils-3.0.17.jar
(246 KB at 931.4 KB/sec)
Downloaded: http://repo.maven.apache.org/maven2/org/eclipse/sisu/org.eclipse.sisu.inject/0.0.0.M5/org.eclipse.sisu.inject-0.0.0.M5.jar
(285 KB at 1422.8 KB/sec)
Downloaded: http://repo.maven.apache.org/maven2/com/google/guava/guava/10.0.1/guava-10.0.1.jar
(1467 KB at 3265.9 KB/sec)
[INFO] 
[INFO] --- maven-clean-plugin:2.5:clean (default-clean) @ apache-whisker-plugin4maven ---
[INFO] 
[INFO] --- apache-rat-plugin:0.10:check (default) @ apache-whisker-plugin4maven ---
[INFO] 51 implicit excludes (use -debug for more details).
[INFO] No excludes explicitly specified.
[INFO] 60 resources included (use -debug for more details)
[INFO] Rat check: Summary of files. Unapproved: 0 unknown: 0 generated: 0 approved: 58 licence.
[INFO] 
[INFO] --- maven-plugin-plugin:3.2:descriptor (default-descriptor) @ apache-whisker-plugin4maven
---
[WARNING] 

Goal prefix is specified as: 'plugin'. Maven currently expects it to be 'apache-whisker4'.

[INFO] Using 'UTF-8' encoding to read mojo metadata.
[INFO] Applying mojo extractor for language: java-annotations
[INFO] Mojo extractor for language: java-annotations found 0 mojo descriptors.
[INFO] Applying mojo extractor for language: java
[INFO] Mojo extractor for language: java found 0 mojo descriptors.
[INFO] Applying mojo extractor for language: bsh
[INFO] Mojo extractor for language: bsh found 0 mojo descriptors.
[INFO] ------------------------------------------------------------------------
[INFO] Reactor Summary:
[INFO] 
[INFO] Apache Whisker .................................... SUCCESS [36.829s]
[INFO] Apache Whisker::Model ............................. SUCCESS [18.362s]
[INFO] Apache Whisker::Scan .............................. SUCCESS [3.124s]
[INFO] Apache Whisker::XML ............................... SUCCESS [6.330s]
[INFO] Apache Whisker::App ............................... SUCCESS [6.125s]
[INFO] Apache Whisker::Output(velocity) .................. SUCCESS [6.163s]
[INFO] Apache Whisker::Command Line Interface ............ SUCCESS [5.381s]
[INFO] Apache Whisker::Plugin(Maven) ..................... FAILURE [5.590s]
[INFO] ------------------------------------------------------------------------
[INFO] BUILD FAILURE
[INFO] ------------------------------------------------------------------------
[INFO] Total time: 1:46.534s
[INFO] Finished at: Fri Aug 22 19:47:10 UTC 2014
[INFO] Final Memory: 21M/83M
[INFO] ------------------------------------------------------------------------
Waiting for Jenkins to finish collecting data[ERROR] Failed to execute goal org.apache.maven.plugins:maven-plugin-plugin:3.2:descriptor
(default-descriptor) on project apache-whisker-plugin4maven: Error extracting plugin descriptor:
'No mojo definitions were found for plugin: org.apache.creadur.whisker:apache-whisker-plugin4maven.'
-> [Help 1]
org.apache.maven.lifecycle.LifecycleExecutionException: Failed to execute goal org.apache.maven.plugins:maven-plugin-plugin:3.2:descriptor
(default-descriptor) on project apache-whisker-plugin4maven: Error extracting plugin descriptor:
'No mojo definitions were found for plugin: org.apache.creadur.whisker:apache-whisker-plugin4maven.'
	at org.apache.maven.lifecycle.internal.MojoExecutor.execute(MojoExecutor.java:217)
	at org.apache.maven.lifecycle.internal.MojoExecutor.execute(MojoExecutor.java:153)
	at org.apache.maven.lifecycle.internal.MojoExecutor.execute(MojoExecutor.java:145)
	at org.apache.maven.lifecycle.internal.LifecycleModuleBuilder.buildProject(LifecycleModuleBuilder.java:84)
	at org.apache.maven.lifecycle.internal.LifecycleModuleBuilder.buildProject(LifecycleModuleBuilder.java:59)
	at org.apache.maven.lifecycle.internal.LifecycleStarter.singleThreadedBuild(LifecycleStarter.java:183)
	at org.apache.maven.lifecycle.internal.LifecycleStarter.execute(LifecycleStarter.java:161)
	at org.apache.maven.DefaultMaven.doExecute(DefaultMaven.java:320)
	at org.apache.maven.DefaultMaven.execute(DefaultMaven.java:156)
	at org.jvnet.hudson.maven3.launcher.Maven3Launcher.main(Maven3Launcher.java:117)
	at sun.reflect.NativeMethodAccessorImpl.invoke0(Native Method)
	at sun.reflect.NativeMethodAccessorImpl.invoke(NativeMethodAccessorImpl.java:39)
	at sun.reflect.DelegatingMethodAccessorImpl.invoke(DelegatingMethodAccessorImpl.java:25)
	at java.lang.reflect.Method.invoke(Method.java:597)
	at org.codehaus.plexus.classworlds.launcher.Launcher.launchStandard(Launcher.java:329)
	at org.codehaus.plexus.classworlds.launcher.Launcher.launch(Launcher.java:239)
	at org.jvnet.hudson.maven3.agent.Maven3Main.launch(Maven3Main.java:178)
	at sun.reflect.NativeMethodAccessorImpl.invoke0(Native Method)
	at sun.reflect.NativeMethodAccessorImpl.invoke(NativeMethodAccessorImpl.java:39)
	at sun.reflect.DelegatingMethodAccessorImpl.invoke(DelegatingMethodAccessorImpl.java:25)
	at java.lang.reflect.Method.invoke(Method.java:597)
	at hudson.maven.Maven3Builder.call(Maven3Builder.java:134)
	at hudson.maven.Maven3Builder.call(Maven3Builder.java:69)
	at hudson.remoting.UserRequest.perform(UserRequest.java:118)
	at hudson.remoting.UserRequest.perform(UserRequest.java:48)
	at hudson.remoting.Request$2.run(Request.java:328)
	at hudson.remoting.InterceptingExecutorService$1.call(InterceptingExecutorService.java:72)
	at java.util.concurrent.FutureTask$Sync.innerRun(FutureTask.java:303)
	at java.util.concurrent.FutureTask.run(FutureTask.java:138)
	at java.util.concurrent.ThreadPoolExecutor$Worker.runTask(ThreadPoolExecutor.java:895)
	at java.util.concurrent.ThreadPoolExecutor$Worker.run(ThreadPoolExecutor.java:918)
	at java.lang.Thread.run(Thread.java:662)
Caused by: org.apache.maven.plugin.MojoExecutionException: Error extracting plugin descriptor:
'No mojo definitions were found for plugin: org.apache.creadur.whisker:apache-whisker-plugin4maven.'
	at org.apache.maven.plugin.plugin.AbstractGeneratorMojo.execute(AbstractGeneratorMojo.java:245)
	at org.apache.maven.plugin.plugin.DescriptorGeneratorMojo.execute(DescriptorGeneratorMojo.java:92)
	at org.apache.maven.plugin.DefaultBuildPluginManager.executeMojo(DefaultBuildPluginManager.java:101)
	at org.apache.maven.lifecycle.internal.MojoExecutor.execute(MojoExecutor.java:209)
	... 31 more
Caused by: org.apache.maven.plugin.descriptor.InvalidPluginDescriptorException: No mojo definitions
were found for plugin: org.apache.creadur.whisker:apache-whisker-plugin4maven.
	at org.apache.maven.tools.plugin.scanner.DefaultMojoScanner.populatePluginDescriptor(DefaultMojoScanner.java:126)
	at org.apache.maven.plugin.plugin.AbstractGeneratorMojo.execute(AbstractGeneratorMojo.java:233)
	... 34 more
[ERROR] 
[ERROR] Re-run Maven using the -X switch to enable full debug logging.
[ERROR] 
[ERROR] For more information about the errors and possible solutions, please read the following
articles:
[ERROR] [Help 1] http://cwiki.apache.org/confluence/display/MAVEN/MojoExecutionException
[ERROR] 
[ERROR] After correcting the problems, you can resume the build with the command
[ERROR]   mvn <goals> -rf :apache-whisker-plugin4maven

[JENKINS] Archiving <https://builds.apache.org/job/Creadur-Whisker/ws/pom.xml> to org.apache.creadur.whisker/apache-whisker/0.2-SNAPSHOT/apache-whisker-0.2-SNAPSHOT.pom
[JENKINS] Archiving <https://builds.apache.org/job/Creadur-Whisker/ws/target/apache-whisker-0.2-SNAPSHOT-site.xml>
to org.apache.creadur.whisker/apache-whisker/0.2-SNAPSHOT/apache-whisker-0.2-SNAPSHOT-site.xml
Sending artifact delta relative to Creadur-Whisker ? Apache Whisker #6
Archived 2 artifacts
Archive block size is 32768
Received 0 blocks and 20402 bytes
Compression is 0.0%
Took 0.16 sec
[JENKINS] Archiving <https://builds.apache.org/job/Creadur-Whisker/ws/apache-whisker-model/pom.xml>
to org.apache.creadur.whisker/apache-whisker-model/0.2-SNAPSHOT/apache-whisker-model-0.2-SNAPSHOT.pom
[JENKINS] Archiving <https://builds.apache.org/job/Creadur-Whisker/ws/apache-whisker-model/target/apache-whisker-model-0.2-SNAPSHOT.jar>
to org.apache.creadur.whisker/apache-whisker-model/0.2-SNAPSHOT/apache-whisker-model-0.2-SNAPSHOT.jar
No prior successful build to compare, so performing full copy of artifacts
[JENKINS] Archiving <https://builds.apache.org/job/Creadur-Whisker/ws/apache-whisker-plugin4maven/pom.xml>
to org.apache.creadur.whisker/apache-whisker-plugin4maven/0.2-SNAPSHOT/apache-whisker-plugin4maven-0.2-SNAPSHOT.pom
No prior successful build to compare, so performing full copy of artifacts
[JENKINS] Archiving <https://builds.apache.org/job/Creadur-Whisker/ws/apache-whisker-xml/pom.xml>
to org.apache.creadur.whisker/apache-whisker-xml/0.2-SNAPSHOT/apache-whisker-xml-0.2-SNAPSHOT.pom
[JENKINS] Archiving <https://builds.apache.org/job/Creadur-Whisker/ws/apache-whisker-xml/target/apache-whisker-xml-0.2-SNAPSHOT.jar>
to org.apache.creadur.whisker/apache-whisker-xml/0.2-SNAPSHOT/apache-whisker-xml-0.2-SNAPSHOT.jar
No prior successful build to compare, so performing full copy of artifacts
[JENKINS] Archiving <https://builds.apache.org/job/Creadur-Whisker/ws/apache-whisker-scan/pom.xml>
to org.apache.creadur.whisker/apache-whisker-scan/0.2-SNAPSHOT/apache-whisker-scan-0.2-SNAPSHOT.pom
[JENKINS] Archiving <https://builds.apache.org/job/Creadur-Whisker/ws/apache-whisker-scan/target/apache-whisker-scan-0.2-SNAPSHOT.jar>
to org.apache.creadur.whisker/apache-whisker-scan/0.2-SNAPSHOT/apache-whisker-scan-0.2-SNAPSHOT.jar
Sending artifact delta relative to Creadur-Whisker ? Apache Whisker::Scan #6
Archived 2 artifacts
Archive block size is 32768
Received 0 blocks and 15049 bytes
Compression is 0.0%
Took 0.16 sec
[JENKINS] Archiving <https://builds.apache.org/job/Creadur-Whisker/ws/apache-whisker-app/pom.xml>
to org.apache.creadur.whisker/apache-whisker-app/0.2-SNAPSHOT/apache-whisker-app-0.2-SNAPSHOT.pom
[JENKINS] Archiving <https://builds.apache.org/job/Creadur-Whisker/ws/apache-whisker-app/target/apache-whisker-app-0.2-SNAPSHOT.jar>
to org.apache.creadur.whisker/apache-whisker-app/0.2-SNAPSHOT/apache-whisker-app-0.2-SNAPSHOT.jar
No prior successful build to compare, so performing full copy of artifacts
[JENKINS] Archiving <https://builds.apache.org/job/Creadur-Whisker/ws/apache-whisker-cli/dependency-reduced-pom.xml>
to org.apache.creadur.whisker/apache-whisker-cli/0.2-SNAPSHOT/apache-whisker-cli-0.2-SNAPSHOT.pom
[JENKINS] Archiving <https://builds.apache.org/job/Creadur-Whisker/ws/apache-whisker-cli/target/apache-whisker-0.2-SNAPSHOT.jar>
to org.apache.creadur.whisker/apache-whisker-cli/0.2-SNAPSHOT/apache-whisker-cli-0.2-SNAPSHOT.jar
No prior successful build to compare, so performing full copy of artifacts
[JENKINS] Archiving <https://builds.apache.org/job/Creadur-Whisker/ws/apache-whisker-velocity/pom.xml>
to org.apache.creadur.whisker/apache-whisker-velocity/0.2-SNAPSHOT/apache-whisker-velocity-0.2-SNAPSHOT.pom
[JENKINS] Archiving <https://builds.apache.org/job/Creadur-Whisker/ws/apache-whisker-velocity/target/apache-whisker-velocity-0.2-SNAPSHOT.jar>
to org.apache.creadur.whisker/apache-whisker-velocity/0.2-SNAPSHOT/apache-whisker-velocity-0.2-SNAPSHOT.jar
No prior successful build to compare, so performing full copy of artifacts
channel stopped

Mime
View raw message