creadur-dev mailing list archives

Site index · List index
Message view « Date » · « Thread »
Top « Date » · « Thread »
From Apache Jenkins Server <jenk...@builds.apache.org>
Subject Build failed in Jenkins: rat-jdk-1.5-maven-2 #77
Date Wed, 30 Jul 2014 22:55:43 GMT
See <https://builds.apache.org/job/rat-jdk-1.5-maven-2/77/changes>

Changes:

[pottlinger] Updated to parent pom v14.
Refactored plugin-plugin version, extracted 3.3 since it's derived from parent pom and only
needed at one place.

[pottlinger] RAT-144: AbstractRatMojo String constant arrays should be private
https://issues.apache.org/jira/browse/RAT-144

-Refactored arrays into unmodifiable lists and reduced visibility of all default excludes.
-Added simple test to ensure size of constant lists.

[pottlinger] RAT-144: AbstractRatMojo String constant arrays should be private
https://issues.apache.org/jira/browse/RAT-144

-Refactored arrays into unmodifiable lists and reduced visibility of all default excludes.

[pottlinger] RAT-136: Upgrade commons-lang to latest commons-lang3
https://issues.apache.org/jira/browse/RAT-136

-Upgraded to most current commons-lang3:3.3.2, optimized imports, added release notes and
new package structure.

------------------------------------------
[...truncated 340 lines...]
AU        apache-rat-core/src/main/java/org/apache/rat/document/impl/guesser/NoteGuesser.java
AU        apache-rat-core/src/main/java/org/apache/rat/document/impl/guesser/GuessUtils.java
A         apache-rat-core/src/main/java/org/apache/rat/document/impl/util
AU        apache-rat-core/src/main/java/org/apache/rat/document/impl/util/DocumentAnalyserMultiplexer.java
AU        apache-rat-core/src/main/java/org/apache/rat/document/impl/FileDocument.java
AU        apache-rat-core/src/main/java/org/apache/rat/document/IDocumentAnalyser.java
AU        apache-rat-core/src/main/java/org/apache/rat/document/ToNameTransformer.java
AU        apache-rat-core/src/main/java/org/apache/rat/document/RatDocumentAnalysisException.java
A         apache-rat-core/src/main/java/org/apache/rat/policy
AU        apache-rat-core/src/main/java/org/apache/rat/policy/DefaultPolicy.java
A         apache-rat-core/src/main/java/org/apache/rat/license
AU        apache-rat-core/src/main/java/org/apache/rat/license/Apache20LicenseFamily.java
AU        apache-rat-core/src/main/java/org/apache/rat/license/GPL1LicenseFamily.java
AU        apache-rat-core/src/main/java/org/apache/rat/license/GPL2LicenseFamily.java
AU        apache-rat-core/src/main/java/org/apache/rat/license/GPL3LicenseFamily.java
AU        apache-rat-core/src/main/java/org/apache/rat/license/CDDL1LicenseFamily.java
AU        apache-rat-core/src/main/java/org/apache/rat/license/W3CSoftwareLicenseFamily.java
AU        apache-rat-core/src/main/java/org/apache/rat/license/ILicenseFamily.java
AU        apache-rat-core/src/main/java/org/apache/rat/license/MITLicenseFamily.java
AU        apache-rat-core/src/main/java/org/apache/rat/license/ModifiedBSDLicenseFamily.java
AU        apache-rat-core/src/main/java/org/apache/rat/license/SimpleLicenseFamily.java
AU        apache-rat-core/src/main/java/org/apache/rat/license/AcademicFree21LicenseFamily.java
AU        apache-rat-core/src/main/java/org/apache/rat/license/W3CDocumentLicenseFamily.java
AU        apache-rat-core/src/main/java/org/apache/rat/license/OASISLicenseFamily.java
AU        apache-rat-core/src/main/java/org/apache/rat/ReportConfiguration.java
AU        apache-rat-core/src/main/java/org/apache/rat/ReportFailedRuntimeException.java
A         apache-rat-core/src/main/java/org/apache/rat/analysis
AU        apache-rat-core/src/main/java/org/apache/rat/analysis/RatHeaderAnalysisException.java
A         apache-rat-core/src/main/java/org/apache/rat/analysis/license
AU        apache-rat-core/src/main/java/org/apache/rat/analysis/license/MITLicense.java
AU        apache-rat-core/src/main/java/org/apache/rat/analysis/license/W3CLicense.java
AU        apache-rat-core/src/main/java/org/apache/rat/analysis/license/AppliedApacheSoftwareLicense20.java
AU        apache-rat-core/src/main/java/org/apache/rat/analysis/license/ApacheSoftwareLicense20.java
AU        apache-rat-core/src/main/java/org/apache/rat/analysis/license/TMF854LicenseHeader.java
AU        apache-rat-core/src/main/java/org/apache/rat/analysis/license/GPL1License.java
AU        apache-rat-core/src/main/java/org/apache/rat/analysis/license/DojoLicenseHeader.java
AU        apache-rat-core/src/main/java/org/apache/rat/analysis/license/GPL2License.java
AU        apache-rat-core/src/main/java/org/apache/rat/analysis/license/GPL3License.java
AU        apache-rat-core/src/main/java/org/apache/rat/analysis/license/BaseLicense.java
AU        apache-rat-core/src/main/java/org/apache/rat/analysis/license/CopyrightHeader.java
AU        apache-rat-core/src/main/java/org/apache/rat/analysis/license/OASISLicense.java
AU        apache-rat-core/src/main/java/org/apache/rat/analysis/license/FullTextMatchingLicense.java
AU        apache-rat-core/src/main/java/org/apache/rat/analysis/license/W3CDocLicense.java
AU        apache-rat-core/src/main/java/org/apache/rat/analysis/license/SimplePatternBasedLicense.java
AU        apache-rat-core/src/main/java/org/apache/rat/analysis/license/CDDL1License.java
AU        apache-rat-core/src/main/java/org/apache/rat/analysis/RatReportAnalysisResultException.java
AU        apache-rat-core/src/main/java/org/apache/rat/analysis/IHeaderMatcher.java
AU        apache-rat-core/src/main/java/org/apache/rat/analysis/DocumentHeaderAnalyser.java
AU        apache-rat-core/src/main/java/org/apache/rat/analysis/DefaultAnalyserFactory.java
A         apache-rat-core/src/main/java/org/apache/rat/analysis/generation
AU        apache-rat-core/src/main/java/org/apache/rat/analysis/generation/GeneratedLicenseNotRequired.java
AU        apache-rat-core/src/main/java/org/apache/rat/analysis/generation/JavaDocLicenseNotRequired.java
A         apache-rat-core/src/main/java/org/apache/rat/analysis/util
AU        apache-rat-core/src/main/java/org/apache/rat/analysis/util/HeaderMatcherMultiplexer.java
AU        apache-rat-core/src/main/java/org/apache/rat/analysis/HeaderCheckWorker.java
A         apache-rat-core/src/main/java/org/apache/rat/walker
AU        apache-rat-core/src/main/java/org/apache/rat/walker/Walker.java
AU        apache-rat-core/src/main/java/org/apache/rat/walker/ArchiveWalker.java
AU        apache-rat-core/src/main/java/org/apache/rat/walker/FileNameComparator.java
AU        apache-rat-core/src/main/java/org/apache/rat/walker/DirectoryWalker.java
AU        apache-rat-core/src/main/java/org/apache/rat/Defaults.java
A         apache-rat-core/src/site
AU        apache-rat-core/src/site/site.xml
A         apache-rat-core/src/site/apt
AU        apache-rat-core/src/site/apt/index.apt.vm
A         apache-rat-core/src/site/resources
A         apache-rat-core/src/site/resources/css
AU        apache-rat-core/src/site/resources/css/site.css
AU        apache-rat-core/pom.xml
AU        BUILD.txt
AU        ant-task-examples.xml
 U        .
At revision 1614787
Parsing POMs
Modules changed, recalculating dependency graph
maven-agent.jar already up to date
classworlds.jar already up to date
maven-interceptor.jar already up to date
maven2.1-interceptor.jar already up to date
[rat-jdk-1.5-maven-2] $ /home/hudson/tools/java/latest1.5/bin/java -cp /home/jenkins/jenkins-slave/maven-agent.jar:/home/jenkins/jenkins-slave/classworlds.jar
hudson.maven.agent.Main /home/hudson/tools/maven/apache-maven-2.2.1 /home/jenkins/jenkins-slave/slave.jar
/home/jenkins/jenkins-slave/maven-interceptor.jar 37494 /home/jenkins/jenkins-slave/maven2.1-interceptor.jar
<===[JENKINS REMOTING CAPACITY]===>   channel started
ERROR: [JENKINS-18403] JDK 5 not supported to run Maven; retrying with slave Java and setting
compile/test properties to point to /home/hudson/tools/java/latest1.5
maven-agent.jar already up to date
classworlds.jar already up to date
maven-interceptor.jar already up to date
maven2.1-interceptor.jar already up to date
[rat-jdk-1.5-maven-2] $ /home/jenkins/tools/java/jdk1.7.0_55/jre/bin/java -cp /home/jenkins/jenkins-slave/maven-agent.jar:/home/jenkins/jenkins-slave/classworlds.jar
hudson.maven.agent.Main /home/hudson/tools/maven/apache-maven-2.2.1 /home/jenkins/jenkins-slave/slave.jar
/home/jenkins/jenkins-slave/maven-interceptor.jar 44316 /home/jenkins/jenkins-slave/maven2.1-interceptor.jar
<===[JENKINS REMOTING CAPACITY]===>   channel started
log4j:WARN No appenders could be found for logger (org.apache.commons.beanutils.converters.BooleanConverter).
log4j:WARN Please initialize the log4j system properly.
Executing Maven:  -B -f <https://builds.apache.org/job/rat-jdk-1.5-maven-2/ws/pom.xml>
-Dmaven.repo.local=/home/jenkins/jenkins-slave/maven-repositories/1 clean install -B -U -e
-fae -V -Prun-its
+ Error stacktraces are turned on.
Apache Maven 2.2.1 (r801777; 2009-08-06 19:16:01+0000)
Java version: 1.7.0_55
Java home: /home/jenkins/tools/java/jdk1.7.0_55/jre
Default locale: en_US, platform encoding: ANSI_X3.4-1968
OS name: "linux" version: "3.13.0-24-generic" arch: "amd64" Family: "unix"
[INFO] Scanning for projects...
[WARNING] 
	Profile with id: 'run-its' has not been activated.

[INFO] Reactor build order: 
[INFO]   Apache Creadur Rat
[INFO]   Apache Creadur Rat::Core
[INFO]   Apache Creadur Rat::Plugin4Maven
[INFO]   Apache Creadur Rat::Tasks4Ant
[INFO]   Apache Creadur Rat::Command Line
[INFO] ------------------------------------------------------------------------
[INFO] Building Apache Creadur Rat
[INFO]    task-segment: [clean, install]
[INFO] ------------------------------------------------------------------------
[INFO] [clean:clean {execution: default-clean}]
[INFO] [remote-resources:process {execution: default}]
[INFO] [site:attach-descriptor {execution: default-attach-descriptor}]
[INFO] [install:install {execution: default-install}]
[INFO] Installing <https://builds.apache.org/job/rat-jdk-1.5-maven-2/ws/pom.xml> to
/home/jenkins/jenkins-slave/maven-repositories/1/org/apache/rat/apache-rat-project/0.11-SNAPSHOT/apache-rat-project-0.11-SNAPSHOT.pom
[INFO] Installing <https://builds.apache.org/job/rat-jdk-1.5-maven-2/ws/target/apache-rat-project-0.11-SNAPSHOT-site.xml>
to /home/jenkins/jenkins-slave/maven-repositories/1/org/apache/rat/apache-rat-project/0.11-SNAPSHOT/apache-rat-project-0.11-SNAPSHOT-site.xml
[INFO] ------------------------------------------------------------------------
[INFO] Building Apache Creadur Rat::Core
[INFO]    task-segment: [clean, install]
[INFO] ------------------------------------------------------------------------
[INFO] [clean:clean {execution: default-clean}]
[INFO] [remote-resources:process {execution: default}]
[INFO] [resources:resources {execution: default-resources}]
[INFO] Using 'UTF-8' encoding to copy filtered resources.
[INFO] Copying 1 resource
[INFO] skip non existing resourceDirectory <https://builds.apache.org/job/rat-jdk-1.5-maven-2/ws/apache-rat-core/src/main/filtered-resources>
[INFO] Copying 1 resource to META-INF
[INFO] Copying 3 resources
[INFO] [compiler:compile {execution: default-compile}]
[INFO] Changes detected - recompiling the module!
[INFO] Compiling 90 source files to <https://builds.apache.org/job/rat-jdk-1.5-maven-2/ws/apache-rat-core/target/classes>
[INFO] -------------------------------------------------------------
[ERROR] COMPILATION ERROR : 
[INFO] -------------------------------------------------------------
[ERROR] <https://builds.apache.org/job/rat-jdk-1.5-maven-2/ws/apache-rat-core/src/main/java/org/apache/rat/report/claim/impl/xml/SimpleXmlClaimReporter.java>:[24,-1]
cannot access org.apache.commons.lang3.time.DateFormatUtils
bad class file: /home/jenkins/jenkins-slave/maven-repositories/1/org/apache/commons/commons-lang3/3.3.2/commons-lang3-3.3.2.jar(org/apache/commons/lang3/time/DateFormatUtils.class)
class file has wrong version 50.0, should be 49.0
[INFO] 1 error
[INFO] -------------------------------------------------------------
[INFO] ------------------------------------------------------------------------
[INFO] SKIPPING Apache Creadur Rat::Plugin4Maven
[INFO]    task-segment: [clean, install]
[INFO] This project has been banned from further executions due to previous failures.
[INFO] ------------------------------------------------------------------------
[INFO] ------------------------------------------------------------------------
[INFO] SKIPPING Apache Creadur Rat::Tasks4Ant
[INFO]    task-segment: [clean, install]
[INFO] This project has been banned from further executions due to previous failures.
[INFO] ------------------------------------------------------------------------
[INFO] ------------------------------------------------------------------------
[INFO] SKIPPING Apache Creadur Rat::Command Line
[INFO]    task-segment: [clean, install]
[INFO] This project has been banned from further executions due to previous failures.
[INFO] ------------------------------------------------------------------------
[INFO] 
[INFO] 
[INFO] ------------------------------------------------------------------------
[INFO] Reactor Summary:
[INFO] ------------------------------------------------------------------------
[INFO] Apache Creadur Rat .................................... SUCCESS [15.227s]
[INFO] Apache Creadur Rat::Core .............................. FAILED [5.335s]
[INFO] Apache Creadur Rat::Plugin4Maven ...................... SKIPPED (dependency build failed
or was skipped)
[INFO] Apache Creadur Rat::Tasks4Ant ......................... SKIPPED (dependency build failed
or was skipped)
[INFO] Apache Creadur Rat::Command Line ...................... SKIPPED (dependency build failed
or was skipped)
[INFO] ------------------------------------------------------------------------
[INFO] Error for project: Apache Creadur Rat::Core (during install)
[INFO] ------------------------------------------------------------------------
[INFO] Compilation failure
<https://builds.apache.org/job/rat-jdk-1.5-maven-2/ws/apache-rat-core/src/main/java/org/apache/rat/report/claim/impl/xml/SimpleXmlClaimReporter.java>:[24,-1]
cannot access org.apache.commons.lang3.time.DateFormatUtils
bad class file: /home/jenkins/jenkins-slave/maven-repositories/1/org/apache/commons/commons-lang3/3.3.2/commons-lang3-3.3.2.jar(org/apache/commons/lang3/time/DateFormatUtils.class)
class file has wrong version 50.0, should be 49.0

[INFO] ------------------------------------------------------------------------
[INFO] Trace
org.apache.maven.BuildFailureException: Compilation failure
<https://builds.apache.org/job/rat-jdk-1.5-maven-2/ws/apache-rat-core/src/main/java/org/apache/rat/report/claim/impl/xml/SimpleXmlClaimReporter.java>:[24,-1]
cannot access org.apache.commons.lang3.time.DateFormatUtils
bad class file: /home/jenkins/jenkins-slave/maven-repositories/1/org/apache/commons/commons-lang3/3.3.2/commons-lang3-3.3.2.jar(org/apache/commons/lang3/time/DateFormatUtils.class)
class file has wrong version 50.0, should be 49.0

	at org.apache.maven.lifecycle.DefaultLifecycleExecutor.executeGoals(DefaultLifecycleExecutor.java:715)
	at org.apache.maven.lifecycle.DefaultLifecycleExecutor.executeGoalWithLifecycle(DefaultLifecycleExecutor.java:556)
	at org.apache.maven.lifecycle.DefaultLifecycleExecutor.executeGoal(DefaultLifecycleExecutor.java:535)
	at org.apache.maven.lifecycle.DefaultLifecycleExecutor.executeGoalAndHandleFailures(DefaultLifecycleExecutor.java:387)
	at org.apache.maven.lifecycle.DefaultLifecycleExecutor.executeTaskSegments(DefaultLifecycleExecutor.java:348)
	at org.apache.maven.lifecycle.DefaultLifecycleExecutor.execute(DefaultLifecycleExecutor.java:180)
	at org.apache.maven.lifecycle.LifecycleExecutorInterceptor.execute(LifecycleExecutorInterceptor.java:65)
	at org.apache.maven.DefaultMaven.doExecute(DefaultMaven.java:328)
	at org.apache.maven.DefaultMaven.execute(DefaultMaven.java:138)
	at org.apache.maven.cli.MavenCli.main(MavenCli.java:362)
	at sun.reflect.NativeMethodAccessorImpl.invoke0(Native Method)
	at sun.reflect.NativeMethodAccessorImpl.invoke(NativeMethodAccessorImpl.java:57)
	at sun.reflect.DelegatingMethodAccessorImpl.invoke(DelegatingMethodAccessorImpl.java:43)
	at java.lang.reflect.Method.invoke(Method.java:606)
	at org.codehaus.classworlds.Launcher.launchEnhanced(Launcher.java:315)
	at org.codehaus.classworlds.Launcher.launch(Launcher.java:255)
	at hudson.maven.agent.Main.launch(Main.java:205)
	at hudson.maven.MavenBuilder.call(MavenBuilder.java:154)
	at hudson.maven.Maven2Builder.call(Maven2Builder.java:79)
	at hudson.maven.Maven2Builder.call(Maven2Builder.java:55)
	at hudson.remoting.UserRequest.perform(UserRequest.java:118)
	at hudson.remoting.UserRequest.perform(UserRequest.java:48)
	at hudson.remoting.Request$2.run(Request.java:328)
	at hudson.remoting.InterceptingExecutorService$1.call(InterceptingExecutorService.java:72)
	at java.util.concurrent.FutureTask.run(FutureTask.java:262)
	at java.util.concurrent.ThreadPoolExecutor.runWorker(ThreadPoolExecutor.java:1145)
	at java.util.concurrent.ThreadPoolExecutor$Worker.run(ThreadPoolExecutor.java:615)
	at java.lang.Thread.run(Thread.java:745)
Caused by: org.apache.maven.plugin.compiler.CompilationFailureException: Compilation failure
<https://builds.apache.org/job/rat-jdk-1.5-maven-2/ws/apache-rat-core/src/main/java/org/apache/rat/report/claim/impl/xml/SimpleXmlClaimReporter.java>:[24,-1]
cannot access org.apache.commons.lang3.time.DateFormatUtils
bad class file: /home/jenkins/jenkins-slave/maven-repositories/1/org/apache/commons/commons-lang3/3.3.2/commons-lang3-3.3.2.jar(org/apache/commons/lang3/time/DateFormatUtils.class)
class file has wrong version 50.0, should be 49.0

	at org.apache.maven.plugin.compiler.AbstractCompilerMojo.execute(AbstractCompilerMojo.java:858)
	at org.apache.maven.plugin.compiler.CompilerMojo.execute(CompilerMojo.java:129)
	at org.apache.maven.plugin.DefaultPluginManager.executeMojo(DefaultPluginManager.java:490)
	at hudson.maven.agent.PluginManagerInterceptor.executeMojo(PluginManagerInterceptor.java:182)
	at org.apache.maven.lifecycle.DefaultLifecycleExecutor.executeGoals(DefaultLifecycleExecutor.java:694)
	... 27 more
[INFO] ------------------------------------------------------------------------
[INFO] BUILD ERRORS
[INFO] ------------------------------------------------------------------------
[INFO] Total time: 28 seconds
[INFO] Finished at: Wed Jul 30 22:53:21 UTC 2014
[INFO] Final Memory: 55M/1297M
[INFO] ------------------------------------------------------------------------
[JENKINS] Archiving /home/jenkins/jenkins-slave/maven-repositories/1/org/apache/rat/apache-rat-project/0.11-SNAPSHOT/apache-rat-project-0.11-SNAPSHOT.pom
to org.apache.rat/apache-rat-project/0.11-SNAPSHOT/apache-rat-project-0.11-SNAPSHOT.pom
[JENKINS] Archiving <https://builds.apache.org/job/rat-jdk-1.5-maven-2/ws/target/apache-rat-project-0.11-SNAPSHOT-site.xml>
to org.apache.rat/apache-rat-project/0.11-SNAPSHOT/apache-rat-project-0.11-SNAPSHOT-site.xml
/home/jenkins/jenkins-slave/maven-repositories/1/org/apache/rat/apache-rat-project/0.11-SNAPSHOT/apache-rat-project-0.11-SNAPSHOT.pom
is not inside <https://builds.apache.org/job/rat-jdk-1.5-maven-2/ws/;> will archive
in a separate pass
Sending artifact delta relative to rat-jdk-1.5-maven-2 ? Apache Creadur Rat #76
Archived 1 artifacts
Archive block size is 32768
Received 0 blocks and 5153 bytes
Compression is 0.0%
Took 0.18 sec
Sending artifact delta relative to rat-jdk-1.5-maven-2 ? Apache Creadur Rat #76
Archived 1 artifacts
Archive block size is 32768
Received 0 blocks and 15987 bytes
Compression is 0.0%
Took 0.11 sec
[JENKINS] Archiving <https://builds.apache.org/job/rat-jdk-1.5-maven-2/ws/apache-rat-core/pom.xml>
to org.apache.rat/apache-rat-core/0.11-SNAPSHOT/apache-rat-core-0.11-SNAPSHOT.pom
Sending artifact delta relative to rat-jdk-1.5-maven-2 ? Apache Creadur Rat::Core #76
Archived 1 artifacts
Archive block size is 32768
Received 0 blocks and 4077 bytes
Compression is 0.0%
Took 80 ms
channel stopped

Mime
View raw message