creadur-dev mailing list archives

Site index · List index
Message view « Date » · « Thread »
Top « Date » · « Thread »
From Apache Jenkins Server <jenk...@builds.apache.org>
Subject Build failed in Jenkins: rat-jdk-1.5-maven-2 #61
Date Wed, 10 Jul 2013 17:29:53 GMT
See <https://builds.apache.org/job/rat-jdk-1.5-maven-2/61/changes>

Changes:

[sebb] A bit more detail

------------------------------------------
[...truncated 200 lines...]
 T E S T S
-------------------------------------------------------
Running org.apache.rat.mp.RatCheckMojoTest
[INFO] 47 implicit excludes (use -debug for more details).
[INFO] No excludes explicitly specified.
[INFO] 1 resources included (use -debug for more details)
[INFO] Rat check: Summary of files. Unapproved: 0 unknown: 0 generated: 0 approved: 1 licence.
[INFO] 47 implicit excludes (use -debug for more details).
[INFO] No excludes explicitly specified.
[INFO] 2 resources included (use -debug for more details)
[INFO] Rat check: Summary of files. Unapproved: 1 unknown: 1 generated: 0 approved: 1 licence.
[INFO] 47 implicit excludes (use -debug for more details).
[INFO] No excludes explicitly specified.
[INFO] 2 resources included (use -debug for more details)
[INFO] Rat check: Summary of files. Unapproved: 1 unknown: 1 generated: 0 approved: 1 licence.
Tests run: 3, Failures: 0, Errors: 0, Skipped: 0, Time elapsed: 13.829 sec - in org.apache.rat.mp.RatCheckMojoTest

Results :

Tests run: 3, Failures: 0, Errors: 0, Skipped: 0

[JENKINS] Recording test results
[INFO] [jar:jar {execution: default-jar}]
[INFO] Building jar: <https://builds.apache.org/job/rat-jdk-1.5-maven-2/ws/apache-rat-plugin/target/apache-rat-plugin-0.10-SNAPSHOT.jar>
[INFO] [plugin:addPluginArtifactMetadata {execution: default-addPluginArtifactMetadata}]
[INFO] [invoker:install {execution: integration-test}]
[INFO] Installing <https://builds.apache.org/job/rat-jdk-1.5-maven-2/ws/pom.xml> to
<https://builds.apache.org/job/rat-jdk-1.5-maven-2/ws/apache-rat-plugin/target/local-repo/org/apache/rat/apache-rat-project/0.10-SNAPSHOT/apache-rat-project-0.10-SNAPSHOT.pom>
[INFO] Installing <https://builds.apache.org/job/rat-jdk-1.5-maven-2/ws/target/apache-rat-project-0.10-SNAPSHOT-site.xml>
to <https://builds.apache.org/job/rat-jdk-1.5-maven-2/ws/apache-rat-plugin/target/local-repo/org/apache/rat/apache-rat-project/0.10-SNAPSHOT/apache-rat-project-0.10-SNAPSHOT-site.xml>
[INFO] Installing <https://builds.apache.org/job/rat-jdk-1.5-maven-2/ws/apache-rat-core/pom.xml>
to <https://builds.apache.org/job/rat-jdk-1.5-maven-2/ws/apache-rat-plugin/target/local-repo/org/apache/rat/apache-rat-core/0.10-SNAPSHOT/apache-rat-core-0.10-SNAPSHOT.pom>
[INFO] Installing <https://builds.apache.org/job/rat-jdk-1.5-maven-2/ws/apache-rat-core/target/apache-rat-core-0.10-SNAPSHOT.jar>
to <https://builds.apache.org/job/rat-jdk-1.5-maven-2/ws/apache-rat-plugin/target/local-repo/org/apache/rat/apache-rat-core/0.10-SNAPSHOT/apache-rat-core-0.10-SNAPSHOT.jar>
[INFO] Installing <https://builds.apache.org/job/rat-jdk-1.5-maven-2/ws/apache-rat-plugin/pom.xml>
to <https://builds.apache.org/job/rat-jdk-1.5-maven-2/ws/apache-rat-plugin/target/local-repo/org/apache/rat/apache-rat-plugin/0.10-SNAPSHOT/apache-rat-plugin-0.10-SNAPSHOT.pom>
[INFO] Installing <https://builds.apache.org/job/rat-jdk-1.5-maven-2/ws/apache-rat-plugin/target/apache-rat-plugin-0.10-SNAPSHOT.jar>
to <https://builds.apache.org/job/rat-jdk-1.5-maven-2/ws/apache-rat-plugin/target/local-repo/org/apache/rat/apache-rat-plugin/0.10-SNAPSHOT/apache-rat-plugin-0.10-SNAPSHOT.jar>
[INFO] [invoker:run {execution: integration-test}]
[INFO] Building: it1/pom.xml
[INFO] run script verify.groovy
[INFO] ..SUCCESS (19.3 s)
[INFO] -------------------------------------------------
[INFO] Build Summary:
[INFO]   Passed: 1, Failed: 0, Errors: 0, Skipped: 0
[INFO] -------------------------------------------------
[INFO] [install:install {execution: default-install}]
[INFO] Installing <https://builds.apache.org/job/rat-jdk-1.5-maven-2/ws/apache-rat-plugin/target/apache-rat-plugin-0.10-SNAPSHOT.jar>
to /export/home/hudson/hudson-slave/maven-repositories/1/org/apache/rat/apache-rat-plugin/0.10-SNAPSHOT/apache-rat-plugin-0.10-SNAPSHOT.jar
[JENKINS] Archiving <https://builds.apache.org/job/rat-jdk-1.5-maven-2/ws/apache-rat-plugin/pom.xml>
to /home/hudson/hudson/jobs/rat-jdk-1.5-maven-2/modules/org.apache.rat$apache-rat-plugin/builds/2013-07-10_17-13-49/archive/org.apache.rat/apache-rat-plugin/0.10-SNAPSHOT/apache-rat-plugin-0.10-SNAPSHOT.pom
[JENKINS] Archiving <https://builds.apache.org/job/rat-jdk-1.5-maven-2/ws/apache-rat-plugin/target/apache-rat-plugin-0.10-SNAPSHOT.jar>
to /home/hudson/hudson/jobs/rat-jdk-1.5-maven-2/modules/org.apache.rat$apache-rat-plugin/builds/2013-07-10_17-13-49/archive/org.apache.rat/apache-rat-plugin/0.10-SNAPSHOT/apache-rat-plugin-0.10-SNAPSHOT.jar
[INFO] ------------------------------------------------------------------------
[INFO] Building Apache Creadur Rat::Tasks4Ant
[INFO]    task-segment: [clean, install]
[INFO] ------------------------------------------------------------------------
[INFO] [clean:clean {execution: default-clean}]
[INFO] [remote-resources:process {execution: default}]
[INFO] [resources:resources {execution: default-resources}]
[INFO] Using 'UTF-8' encoding to copy filtered resources.
[INFO] Copying 1 resource
[INFO] skip non existing resourceDirectory <https://builds.apache.org/job/rat-jdk-1.5-maven-2/ws/apache-rat-tasks/src/main/filtered-resources>
[INFO] Copying 1 resource to META-INF
[INFO] Copying 3 resources
[INFO] [compiler:compile {execution: default-compile}]
[INFO] Changes detected - recompiling the module!
[INFO] Compiling 4 source files to <https://builds.apache.org/job/rat-jdk-1.5-maven-2/ws/apache-rat-tasks/target/classes>
[INFO] [dependency:copy-dependencies {execution: default}]
[INFO] Copying ant-antunit-1.1.jar to <https://builds.apache.org/job/rat-jdk-1.5-maven-2/ws/apache-rat-tasks/target/dependencies/ant-antunit.jar>
[INFO] [resources:testResources {execution: default-testResources}]
[INFO] Using 'UTF-8' encoding to copy filtered resources.
[INFO] Copying 5 resources
[INFO] Copying 3 resources
[INFO] [compiler:testCompile {execution: default-testCompile}]
[INFO] Changes detected - recompiling the module!
[INFO] Compiling 4 source files to <https://builds.apache.org/job/rat-jdk-1.5-maven-2/ws/apache-rat-tasks/target/test-classes>
[INFO] [surefire:test {execution: default-test}]
[INFO] Surefire report directory: <https://builds.apache.org/job/rat-jdk-1.5-maven-2/ws/apache-rat-tasks/target/surefire-reports>

-------------------------------------------------------
 T E S T S
-------------------------------------------------------
Running org.apache.rat.anttasks.ReportTest
Tests run: 7, Failures: 0, Errors: 0, Skipped: 0, Time elapsed: 1.338 sec - in org.apache.rat.anttasks.ReportTest

Results :

Tests run: 7, Failures: 0, Errors: 0, Skipped: 0

[JENKINS] Recording test results
[INFO] [antrun:run {execution: default}]
[INFO] Executing tasks

main:

allTests:
[au:antunit] Build File: <https://builds.apache.org/job/rat-jdk-1.5-maven-2/ws/apache-rat-tasks/src/test/resources/antunit/report-bad-configurations.xml>
[au:antunit] Tests run: 10, Failures: 0, Errors: 0, Time elapsed: 0.574 sec
[au:antunit] Target: testNoStylesheet took 0.044 sec
[au:antunit] Target: testNoResources took 0 sec
[au:antunit] Target: testSubstringMatcherRequiresFamilyName took 0.246 sec
[au:antunit] Target: testFullTextMatcherRequiresFamilyName took 0.034 sec
[au:antunit] Target: testUnusedStylesheet took 0.062 sec
[au:antunit] Target: testFullTextMatcherRequiresText took 0.035 sec
[au:antunit] Target: testSubstringMatcherRequiresFamilyCategory took 0.036 sec
[au:antunit] Target: testSubstringMatcherRequiresPattern took 0.026 sec
[au:antunit] Target: testNoLicenseMatchers took 0.001 sec
[au:antunit] Target: testFullTextMatcherRequiresFamilyCategory took 0.027 sec
    [mkdir] Created dir: <https://builds.apache.org/job/rat-jdk-1.5-maven-2/ws/apache-rat-tasks/target/testoutput/dest>

allTests:
[au:antunit] Build File: <https://builds.apache.org/job/rat-jdk-1.5-maven-2/ws/apache-rat-tasks/src/test/resources/antunit/report-normal-operation.xml>
[au:antunit] Tests run: 11, Failures: 0, Errors: 1, Time elapsed: 2.172 sec
[au:antunit] Target: testFullTextMatcherNotApprovedSentToFile took 0.142 sec
[au:antunit] Target: testFullTextMatcherSentToFileNoMatch took 0.14 sec
[au:antunit] Target: testFullTextMatcherApprovedSentToFile took 0.106 sec
[au:antunit] Target: testFullTextMatcherExpandsProperties took 0.191 sec
[au:antunit] Target: testXMLReportSentToFile took 0.079 sec
[au:antunit] Target: testSubstringMatcherApprovedSentToFile took 0.108 sec
[au:antunit] Target: testSubstringMatcherSentToFileNoMatch took 0.102 sec
[au:antunit] Target: testSubstringMatcherNotApprovedSentToFile took 0.102 sec
[au:antunit] Target: testWithALUnknownSentToFile took 0.106 sec
[au:antunit] Target: testWithReportSentToFile took 0.095 sec
[au:antunit] Target: testCustomMatcherSentToFile  caused an ERROR
[au:antunit] 	at line 333, column 43
[au:antunit] 	Message: Unable to find a javac compiler;
[au:antunit] com.sun.tools.javac.Main is not on the classpath.
[au:antunit] Perhaps JAVA_HOME does not point to the JDK.
[au:antunit] It is currently set to "/zonestorage/hudson_solaris/home/hudson/tools/java/jdk1.5.0_22/jre"
[au:antunit] 	took 0.022 sec
[INFO] Executed tasks
[INFO] [jar:jar {execution: default-jar}]
[INFO] Building jar: <https://builds.apache.org/job/rat-jdk-1.5-maven-2/ws/apache-rat-tasks/target/apache-rat-tasks-0.10-SNAPSHOT.jar>
[INFO] [install:install {execution: default-install}]
[INFO] Installing <https://builds.apache.org/job/rat-jdk-1.5-maven-2/ws/apache-rat-tasks/target/apache-rat-tasks-0.10-SNAPSHOT.jar>
to /export/home/hudson/hudson-slave/maven-repositories/1/org/apache/rat/apache-rat-tasks/0.10-SNAPSHOT/apache-rat-tasks-0.10-SNAPSHOT.jar
[JENKINS] Archiving <https://builds.apache.org/job/rat-jdk-1.5-maven-2/ws/apache-rat-tasks/pom.xml>
to /home/hudson/hudson/jobs/rat-jdk-1.5-maven-2/modules/org.apache.rat$apache-rat-tasks/builds/2013-07-10_17-13-50/archive/org.apache.rat/apache-rat-tasks/0.10-SNAPSHOT/apache-rat-tasks-0.10-SNAPSHOT.pom
[JENKINS] Archiving <https://builds.apache.org/job/rat-jdk-1.5-maven-2/ws/apache-rat-tasks/target/apache-rat-tasks-0.10-SNAPSHOT.jar>
to /home/hudson/hudson/jobs/rat-jdk-1.5-maven-2/modules/org.apache.rat$apache-rat-tasks/builds/2013-07-10_17-13-50/archive/org.apache.rat/apache-rat-tasks/0.10-SNAPSHOT/apache-rat-tasks-0.10-SNAPSHOT.jar
[INFO] ------------------------------------------------------------------------
[INFO] Building Apache Creadur Rat::Command Line
[INFO]    task-segment: [clean, install]
[INFO] ------------------------------------------------------------------------
[INFO] [clean:clean {execution: default-clean}]
[INFO] [remote-resources:process {execution: default}]
[INFO] [resources:resources {execution: default-resources}]
[INFO] Using 'UTF-8' encoding to copy filtered resources.
[INFO] Copying 2 resources to META-INF
[INFO] Copying 3 resources
[INFO] [compiler:compile {execution: default-compile}]
[INFO] No sources to compile
[INFO] [resources:testResources {execution: default-testResources}]
[INFO] Using 'UTF-8' encoding to copy filtered resources.
[INFO] skip non existing resourceDirectory <https://builds.apache.org/job/rat-jdk-1.5-maven-2/ws/apache-rat/src/test/resources>
[INFO] Copying 3 resources
[INFO] [compiler:testCompile {execution: default-testCompile}]
[INFO] No sources to compile
[INFO] [surefire:test {execution: default-test}]
[JENKINS] Recording test results[INFO] [dependency:unpack-dependencies {execution: default}]
[INFO] Unpacking /export/home/hudson/hudson-slave/maven-repositories/1/commons-io/commons-io/2.2/commons-io-2.2.jar
to <https://builds.apache.org/job/rat-jdk-1.5-maven-2/ws/apache-rat/target/classes>
with includes "" and excludes "META-INF/**"

[INFO] Unpacking /export/home/hudson/hudson-slave/maven-repositories/1/commons-collections/commons-collections/3.2.1/commons-collections-3.2.1.jar
to <https://builds.apache.org/job/rat-jdk-1.5-maven-2/ws/apache-rat/target/classes>
with includes "" and excludes "META-INF/**"
[INFO] Unpacking <https://builds.apache.org/job/rat-jdk-1.5-maven-2/ws/apache-rat-tasks/target/apache-rat-tasks-0.10-SNAPSHOT.jar>
to <https://builds.apache.org/job/rat-jdk-1.5-maven-2/ws/apache-rat/target/classes>
with includes "" and excludes "META-INF/**"
[INFO] Unpacking /export/home/hudson/hudson-slave/maven-repositories/1/org/apache/commons/commons-compress/1.5/commons-compress-1.5.jar
to <https://builds.apache.org/job/rat-jdk-1.5-maven-2/ws/apache-rat/target/classes>
with includes "" and excludes "META-INF/**"
[INFO] Unpacking /export/home/hudson/hudson-slave/maven-repositories/1/commons-cli/commons-cli/1.2/commons-cli-1.2.jar
to <https://builds.apache.org/job/rat-jdk-1.5-maven-2/ws/apache-rat/target/classes>
with includes "" and excludes "META-INF/**"
[INFO] Unpacking <https://builds.apache.org/job/rat-jdk-1.5-maven-2/ws/apache-rat-core/target/apache-rat-core-0.10-SNAPSHOT.jar>
to <https://builds.apache.org/job/rat-jdk-1.5-maven-2/ws/apache-rat/target/classes>
with includes "" and excludes "META-INF/**"
[INFO] Unpacking /export/home/hudson/hudson-slave/maven-repositories/1/commons-lang/commons-lang/2.6/commons-lang-2.6.jar
to <https://builds.apache.org/job/rat-jdk-1.5-maven-2/ws/apache-rat/target/classes>
with includes "" and excludes "META-INF/**"
[INFO] [jar:jar {execution: default-jar}]
[JENKINS] Archiving <https://builds.apache.org/job/rat-jdk-1.5-maven-2/ws/apache-rat/pom.xml>
to /home/hudson/hudson/jobs/rat-jdk-1.5-maven-2/modules/org.apache.rat$apache-rat/builds/2013-07-10_17-13-51/archive/org.apache.rat/apache-rat/0.10-SNAPSHOT/apache-rat-0.10-SNAPSHOT.pom
[INFO] 
[INFO] 
[INFO] ------------------------------------------------------------------------
[INFO] Reactor Summary:
[INFO] ------------------------------------------------------------------------
[INFO] Apache Creadur Rat .................................... SUCCESS [2:22.474s]
[INFO] Apache Creadur Rat::Core .............................. SUCCESS [3:42.879s]
[INFO] Apache Creadur Rat::Plugin4Maven ...................... SUCCESS [2:03.635s]
[INFO] Apache Creadur Rat::Tasks4Ant ......................... SUCCESS [33.748s]
[INFO] Apache Creadur Rat::Command Line ...................... FAILED [1:30.044s]
[INFO] ------------------------------------------------------------------------
[INFO] Error for project: Apache Creadur Rat::Command Line (during install)
[INFO] ------------------------------------------------------------------------
[INFO] Error assembling JAR

Embedded error: Failed to read filesystem attributes for: <https://builds.apache.org/job/rat-jdk-1.5-maven-2/ws/apache-rat/pom.xml>
Not enough space
[INFO] ------------------------------------------------------------------------
[INFO] Trace
org.apache.maven.lifecycle.LifecycleExecutionException: Error assembling JAR
	at org.apache.maven.lifecycle.DefaultLifecycleExecutor.executeGoals(DefaultLifecycleExecutor.java:719)
	at org.apache.maven.lifecycle.DefaultLifecycleExecutor.executeGoalWithLifecycle(DefaultLifecycleExecutor.java:556)
	at org.apache.maven.lifecycle.DefaultLifecycleExecutor.executeGoal(DefaultLifecycleExecutor.java:535)
	at org.apache.maven.lifecycle.DefaultLifecycleExecutor.executeGoalAndHandleFailures(DefaultLifecycleExecutor.java:387)
	at org.apache.maven.lifecycle.DefaultLifecycleExecutor.executeTaskSegments(DefaultLifecycleExecutor.java:348)
	at org.apache.maven.lifecycle.DefaultLifecycleExecutor.execute(DefaultLifecycleExecutor.java:180)
	at org.apache.maven.lifecycle.LifecycleExecutorInterceptor.execute(LifecycleExecutorInterceptor.java:65)
	at org.apache.maven.DefaultMaven.doExecute(DefaultMaven.java:328)
	at org.apache.maven.DefaultMaven.execute(DefaultMaven.java:138)
	at org.apache.maven.cli.MavenCli.main(MavenCli.java:362)
	at sun.reflect.NativeMethodAccessorImpl.invoke0(Native Method)
	at sun.reflect.NativeMethodAccessorImpl.invoke(NativeMethodAccessorImpl.java:39)
	at sun.reflect.DelegatingMethodAccessorImpl.invoke(DelegatingMethodAccessorImpl.java:25)
	at java.lang.reflect.Method.invoke(Method.java:592)
	at org.codehaus.classworlds.Launcher.launchEnhanced(Launcher.java:315)
	at org.codehaus.classworlds.Launcher.launch(Launcher.java:255)
	at hudson.maven.agent.Main.launch(Main.java:185)
	at hudson.maven.MavenBuilder.call(MavenBuilder.java:154)
	at hudson.maven.Maven2Builder.call(Maven2Builder.java:79)
	at hudson.maven.Maven2Builder.call(Maven2Builder.java:55)
	at hudson.remoting.UserRequest.perform(UserRequest.java:118)
	at hudson.remoting.UserRequest.perform(UserRequest.java:48)
	at hudson.remoting.Request$2.run(Request.java:326)
	at hudson.remoting.InterceptingExecutorService$1.call(InterceptingExecutorService.java:72)
	at java.util.concurrent.FutureTask$Sync.innerRun(FutureTask.java:269)
	at java.util.concurrent.FutureTask.run(FutureTask.java:123)
	at java.util.concurrent.ThreadPoolExecutor$Worker.runTask(ThreadPoolExecutor.java:651)
	at java.util.concurrent.ThreadPoolExecutor$Worker.run(ThreadPoolExecutor.java:676)
	at java.lang.Thread.run(Thread.java:595)
Caused by: org.apache.maven.plugin.MojoExecutionException: Error assembling JAR
	at org.apache.maven.plugin.jar.AbstractJarMojo.createArchive(AbstractJarMojo.java:237)
	at org.apache.maven.plugin.jar.AbstractJarMojo.execute(AbstractJarMojo.java:255)
	at org.apache.maven.plugin.DefaultPluginManager.executeMojo(DefaultPluginManager.java:490)
	at hudson.maven.agent.PluginManagerInterceptor.executeMojo(PluginManagerInterceptor.java:182)
	at org.apache.maven.lifecycle.DefaultLifecycleExecutor.executeGoals(DefaultLifecycleExecutor.java:694)
	... 28 more
Caused by: org.codehaus.plexus.archiver.ArchiverException: Failed to read filesystem attributes
for: <https://builds.apache.org/job/rat-jdk-1.5-maven-2/ws/apache-rat/pom.xml>
	at org.codehaus.plexus.archiver.ArchiveEntry.createFileEntry(ArchiveEntry.java:163)
	at org.codehaus.plexus.archiver.AbstractArchiver.addFile(AbstractArchiver.java:404)
	at org.codehaus.plexus.archiver.AbstractArchiver.addFile(AbstractArchiver.java:316)
	at org.apache.maven.archiver.MavenArchiver.createArchive(MavenArchiver.java:526)
	at org.apache.maven.plugin.jar.AbstractJarMojo.createArchive(AbstractJarMojo.java:230)
	... 32 more
Caused by: java.io.IOException: Failed to quote directory: '<https://builds.apache.org/job/rat-jdk-1.5-maven-2/ws/apache-rat/pom.xml'>
	at org.codehaus.plexus.components.io.attributes.PlexusIoResourceAttributeUtils.getFileAttributesByPath(PlexusIoResourceAttributeUtils.java:256)
	at org.codehaus.plexus.components.io.attributes.PlexusIoResourceAttributeUtils.getFileAttributes(PlexusIoResourceAttributeUtils.java:172)
	at org.codehaus.plexus.archiver.ArchiveEntry.createFileEntry(ArchiveEntry.java:159)
	... 36 more
Caused by: org.codehaus.plexus.util.cli.CommandLineException: Error while executing process.
	at org.codehaus.plexus.util.cli.Commandline.execute(Commandline.java:656)
	at org.codehaus.plexus.util.cli.CommandLineUtils.executeCommandLineAsCallable(CommandLineUtils.java:140)
	at org.codehaus.plexus.components.io.attributes.PlexusIoResourceAttributeUtils.getFileAttributesByPath(PlexusIoResourceAttributeUtils.java:247)
	... 38 more
Caused by: java.io.IOException: Not enough space
	at java.lang.UNIXProcess.forkAndExec(Native Method)
	at java.lang.UNIXProcess.<init>(UNIXProcess.java:53)
	at java.lang.ProcessImpl.start(ProcessImpl.java:65)
	at java.lang.ProcessBuilder.start(ProcessBuilder.java:451)
	at java.lang.Runtime.exec(Runtime.java:591)
	at java.lang.Runtime.exec(Runtime.java:507)
	at org.codehaus.plexus.util.cli.Commandline.execute(Commandline.java:636)
	... 40 more
[INFO] ------------------------------------------------------------------------
[INFO] BUILD ERRORS
[INFO] ------------------------------------------------------------------------
[INFO] Total time: 11 minutes 48 seconds
[INFO] Finished at: Wed Jul 10 17:29:56 GMT+00:00 2013
[INFO] Final Memory: 84M/194M
[INFO] ------------------------------------------------------------------------
channel stopped

Mime
View raw message