creadur-dev mailing list archives

Site index · List index
Message view « Date » · « Thread »
Top « Date » · « Thread »
From "Gavin McDonald" <ga...@16degrees.com.au>
Subject FW: [GUMP@vmgump]: Project rat (in module rat) failed
Date Wed, 23 Jan 2013 05:10:03 GMT


> -----Original Message-----
> From: bodewig@apache.org [mailto:bodewig@apache.org]
> Sent: Wednesday, 23 January 2013 3:19 PM
> To: rat-dev@incubator.apache.org
> Subject: [GUMP@vmgump]: Project rat (in module rat) failed
> 
> To whom it may engage...
> 
> This is an automated request, but not an unsolicited one. For more
> information please visit http://gump.apache.org/nagged.html,
> and/or contact the folk at general@gump.apache.org.
> 
> Project rat has an issue affecting its community integration.
> This issue affects 2 projects,
>  and has been outstanding for 2 runs.
> The current state of this project is 'Failed', with reason 'Build Failed'.
> For reference only, the following projects are affected by this:
>     - rat :  Release Audit Tool
>     - rat-test :  Release Audit Tool
> 
> 
> Full details are available at:
>     http://vmgump.apache.org/gump/public/rat/rat/index.html
> 
> That said, some information snippets are provided here.
> 
> The following annotations (debug/informational/warning/error messages)
> were provided:
>  -WARNING- Bad *Optional* Dependency. Project: httpcomponents-
> httpclient : unknown to *this* workspace
>  -INFO- Optional dependency commons-validator prerequisite failed with
> reason build failed
>  -INFO- Optional dependency commons-digester prerequisite failed with
> reason build failed
>  -INFO- Optional dependency commons-beanutils prerequisite failed with
> reason build failed
>  -INFO- Optional dependency commons-logging prerequisite failed with
> reason build failed
>  -INFO- Optional dependency commons-collections failed with reason build
> failed
>  -INFO- Optional dependency commons-cli failed with reason build failed
>  -DEBUG- (Apache Gump generated) Apache Maven Settings in:
> /srv/gump/public/workspace/rat/gump_mvn_settings.xml
>  -INFO- Failed with reason build failed
>  -DEBUG- Maven POM in: /srv/gump/public/workspace/rat/pom.xml
>  -DEBUG- Extracted fallback artifacts from Gump Repository
> 
> 
> 
> The following work was performed:
> http://vmgump.apache.org/gump/public/rat/rat/gump_work/build_rat_rat.
> html
> Work Name: build_rat_rat (Type: Build)
> Work ended in a state of : Failed
> Elapsed: 34 secs
> Command Line: /opt/maven2/bin/mvn --batch-mode -DskipTests=true --
> settings /srv/gump/public/workspace/rat/gump_mvn_settings.xml package
> [Working Directory: /srv/gump/public/workspace/rat]
> M2_HOME: /opt/maven2
> ---------------------------------------------
> 11K downloaded  (wagon-1.0-beta-7.pom)
> Downloading:
> http://localhost:8192/maven2/org/apache/maven/wagon/wagon-ssh-
> common/1.0-beta-7/wagon-ssh-common-1.0-beta-7.pom
> 1K downloaded  (wagon-ssh-common-1.0-beta-7.pom)
> Downloading:
> http://localhost:8192/maven2/org/apache/maven/wagon/wagon-provider-
> api/1.0-beta-7/wagon-provider-api-1.0-beta-7.pom
> 1K downloaded  (wagon-provider-api-1.0-beta-7.pom)
> Downloading:
> http://localhost:8192/maven2/org/apache/maven/wagon/wagon-ssh/1.0-
> beta-7/wagon-ssh-1.0-beta-7.jar
> 27K downloaded  (wagon-ssh-1.0-beta-7.jar)
> Downloading:
> http://localhost:8192/maven2/org/apache/maven/wagon/wagon-ssh-
> common/1.0-beta-7/wagon-ssh-common-1.0-beta-7.jar
> 26K downloaded  (wagon-ssh-common-1.0-beta-7.jar) [INFO]
------------------
> ------------------------------------------------------
> [INFO] Building Apache Rat
> [INFO]    task-segment: [package]
> [INFO]
------------------------------------------------------------------------
> [INFO] Setting property: classpath.resource.loader.class =>
> 'org.codehaus.plexus.velocity.ContextClassLoaderResourceLoader'.
> [INFO] Setting property: velocimacro.messages.on => 'false'.
> [INFO] Setting property: resource.loader => 'classpath'.
> [INFO] Setting property: resource.manager.logwhenfound => 'false'.
> [INFO] [remote-resources:process {execution: default}]
> Downloading:
> http://localhost:8192/maven2/org/apache/maven/doxia/doxia-
> modules/1.3/doxia-modules-1.3.pom
> 2K downloaded  (doxia-modules-1.3.pom)
> [WARNING] *** CHECKSUM FAILED - Checksum failed on download: local =
> 'da39a3ee5e6b4b0d3255bfef95601890afd80709'; remote =
> '0a8852b90bf09d5e216167a45c4f8ecb0a9d82c1' - RETRYING
> Downloading:
> http://localhost:8192/maven2/org/apache/maven/doxia/doxia-
> modules/1.3/doxia-modules-1.3.pom
> 2K downloaded  (doxia-modules-1.3.pom)
> [WARNING] *** CHECKSUM FAILED - Checksum failed on download: local =
> 'da39a3ee5e6b4b0d3255bfef95601890afd80709'; remote =
> '0a8852b90bf09d5e216167a45c4f8ecb0a9d82c1' - IGNORING [INFO] Unable to
> find resource 'org.apache.maven.doxia:doxia-modules:pom:1.3' in repository
> central (http://repo1.maven.org/maven2)
> Downloading:
> http://localhost:8192/maven2/org/apache/maven/doxia/doxia-
> modules/1.3/doxia-modules-1.3.pom
> 2K downloaded  (doxia-modules-1.3.pom)
> [WARNING] *** CHECKSUM FAILED - Checksum failed on download: local =
> 'da39a3ee5e6b4b0d3255bfef95601890afd80709'; remote =
> '0a8852b90bf09d5e216167a45c4f8ecb0a9d82c1' - RETRYING
> Downloading:
> http://localhost:8192/maven2/org/apache/maven/doxia/doxia-
> modules/1.3/doxia-modules-1.3.pom
> 2K downloaded  (doxia-modules-1.3.pom)
> [WARNING] *** CHECKSUM FAILED - Checksum failed on download: local =
> 'da39a3ee5e6b4b0d3255bfef95601890afd80709'; remote =
> '0a8852b90bf09d5e216167a45c4f8ecb0a9d82c1' - IGNORING [INFO] Unable to
> find resource 'org.apache.maven.doxia:doxia-modules:pom:1.3' in repository
> central (http://repo1.maven.org/maven2) [INFO]
---------------------------------
> ---------------------------------------
> [ERROR] BUILD ERROR
> [INFO]
------------------------------------------------------------------------
> [INFO] Error building POM (may not be this project's POM).
> 
> 
> Project ID: null:doxia-module-xhtml:jar:null
> 
> Reason: Cannot find parent: org.apache.maven.doxia:doxia-modules for
> project: null:doxia-module-xhtml:jar:null for project null:doxia-module-
> xhtml:jar:null
> 
> 
> [INFO]
------------------------------------------------------------------------
> [INFO] For more information, run Maven with the -e switch
> [INFO]
------------------------------------------------------------------------
> [INFO] Total time: 33 seconds
> [INFO] Finished at: Wed Jan 23 04:49:04 UTC 2013
> [INFO] Final Memory: 23M/56M
> [INFO]
------------------------------------------------------------------------
> ---------------------------------------------
> 
> To subscribe to this information via syndicated feeds:
> - RSS: http://vmgump.apache.org/gump/public/rat/rat/rss.xml
> - Atom: http://vmgump.apache.org/gump/public/rat/rat/atom.xml
> 
> ============================== Gump Tracking Only ===
> Produced by Apache Gump(TM) version 2.3.
> Gump Run 11000023012013, vmgump.apache.org:vmgump:11000023012013
> Gump E-mail Identifier (unique within run) #69.
> 
> --
> Apache Gump
> http://gump.apache.org/ [Instance: vmgump]


Mime
View raw message