couchdb-dev mailing list archives

Site index · List index
Message view « Date » · « Thread »
Top « Date » · « Thread »
From Andy Wenk <a...@nms.de>
Subject Re: rcouch merge - new intermediate status
Date Thu, 16 Jan 2014 20:47:46 GMT
On 16 January 2014 10:14, Benoit Chesneau <bchesneau@gmail.com> wrote:

> On Wed, Jan 15, 2014 at 11:07 PM, Andy Wenk <andy@nms.de> wrote:
>
>>
>> my results on Mac OS X Mavericks 10.9.1 with R16B03
>>
>> tested against branch 1994-merge-rcouch
>> commit 6616e1d5696f9
>>
>> make is working
>> make libs=shared is working
>> make check:
>>
>> Test Summary Report
>> -------------------
>> /Users/andwen/project/couchdb/couchdb-src-rcouch/test/etap/042-work-queue.t
>>                    (Wstat: 0 Tests: 153 Failed: 0)
>>   Parse errors: Bad plan.  You planned 155 tests but ran 153.
>> Files=50, Tests=1187, 253 wallclock secs ( 0.54 usr  0.11 sys + 86.74
>> cusr 22.86 csys = 110.25 CPU)
>> Result: FAIL
>> make: *** [test] Error 1
>>
>> make rel is working fine
>> -> Verify Your Installation.Your installation looks fine. Time to Relax.
>>
>> tests in _utils/couch_tests.html are freezing my Chrome. Alex told me not
>> to run them so I think we can ignore that here :)
>>
>> make testjs
>> results -> https://friendpaste.com/6LUxyQk4zqpJsdLyRHJUE7
>>
>> make icu=static working
>>
>> make test
>> ->
>> /Users/andwen/project/couchdb/couchdb-src-rcouch/apps/couch_replicator/test/04-replication-large-atts.t
>> ... 545/? Bailout called.  Further testing stopped:  Timeout waiting for
>> replication to finish
>> FAILED--Further testing stopped: Timeout waiting for replication to finish
>> make: *** [test] Error 127
>>
>> last one as you expected ...
>>
>> So far ... I hope that helps. If you want me to test further let me know
>> ...
>>
>> Cheers
>>
>> Andy
>>
>> --
>>
>>
> Interesting I don't reproduce that on my mac, what's your machine? From
> the logs I see it sound like a timing issue. It should probably sleep
> between each tests.  Will try it on a slower machine.
>
> - benoit
>
>
Benoit,

here are some details about my machine:

  Model Name: MacBook Pro
  Model Identifier: MacBookPro11,1
  Processor Name: Intel Core i7
  Processor Speed: 2,8 GHz
  Number of Processors: 1
  Total Number of Cores: 2
  L2 Cache (per Core): 256 KB
  L3 Cache: 4 MB
  Memory: 16 GB
  Boot ROM Version: MBP111.0138.B03
  SMC Version (system): 2.16f58

disk0s2:
  Media Name: APPLE SSD SM0512F Media
  Size: 499,42 GB (499.418.034.176 bytes)

It's the new MBP I got from my new employer

Cheers

Andy

-- 
Andy Wenk
Hamburg - Germany
RockIt!

http://www.couchdb-buch.de
http://www.pg-praxisbuch.de

GPG fingerprint: C044 8322 9E12 1483 4FEC 9452 B65D 6BE3 9ED3 9588

https://people.apache.org/keys/committer/andywenk.asc

Mime
  • Unnamed multipart/alternative (inline, None, 0 bytes)
View raw message