couchdb-dev mailing list archives

Site index · List index
Message view « Date » · « Thread »
Top « Date » · « Thread »
From "hkjang (JIRA)" <j...@apache.org>
Subject [jira] [Created] (COUCHDB-1801) Error on couchdb when it is installing
Date Wed, 22 May 2013 04:55:20 GMT
hkjang created COUCHDB-1801:
-------------------------------

             Summary: Error on couchdb when it is installing
                 Key: COUCHDB-1801
                 URL: https://issues.apache.org/jira/browse/COUCHDB-1801
             Project: CouchDB
          Issue Type: Bug
          Components: Build System
            Reporter: hkjang


Error on couchdb when it is installing
how can i fix that..?
can i get some comment ?
thanks 


couchdb1.3.0
redhat linux 5.9



......................................

/usr/local/bin/erlc  mochiweb_util.erl
/usr/local/bin/erlc  reloader.erl
make[3]: Leaving directory `/home/idapp/apache-couchdb-1.3.0/src/mochiweb'
Making all in snappy
make[3]: Entering directory `/home/idapp/apache-couchdb-1.3.0/src/snappy'
/bin/sh ../../libtool  --tag=CXX   --mode=compile g++ -DHAVE_CONFIG_H -I. -I../.. -I../../src/snappy/google-snappy
  -D_XOPEN_SOURCE  -I/opt/local/include -I/opt/local/include/js -I/usr/local/include -I/usr/local/include/js
-I/usr/include -I/usr/include/js  -I/usr/local/lib/erlang/erts-5.9.1/include/  -g -O2 -MT
snappy_nif_la-snappy_nif.lo -MD -MP -MF .deps/snappy_nif_la-snappy_nif.Tpo -c -o snappy_nif_la-snappy_nif.lo
`test -f 'snappy_nif.cc' || echo './'`snappy_nif.cc
libtool: compile:  g++ -DHAVE_CONFIG_H -I. -I../.. -I../../src/snappy/google-snappy -D_XOPEN_SOURCE
-I/opt/local/include -I/opt/local/include/js -I/usr/local/include -I/usr/local/include/js
-I/usr/include -I/usr/include/js -I/usr/local/lib/erlang/erts-5.9.1/include/ -g -O2 -MT snappy_nif_la-snappy_nif.lo
-MD -MP -MF .deps/snappy_nif_la-snappy_nif.Tpo -c snappy_nif.cc  -fPIC -DPIC -o .libs/snappy_nif_la-snappy_nif.o
mv -f .deps/snappy_nif_la-snappy_nif.Tpo .deps/snappy_nif_la-snappy_nif.Plo
/bin/sh ../../libtool  --tag=CXX   --mode=compile g++ -DHAVE_CONFIG_H -I. -I../.. -I../../src/snappy/google-snappy
  -D_XOPEN_SOURCE  -I/opt/local/include -I/opt/local/include/js -I/usr/local/include -I/usr/local/include/js
-I/usr/include -I/usr/include/js  -I/usr/local/lib/erlang/erts-5.9.1/include/  -g -O2 -MT
snappy_nif_la-snappy.lo -MD -MP -MF .deps/snappy_nif_la-snappy.Tpo -c -o snappy_nif_la-snappy.lo
`test -f 'google-snappy/snappy.cc' || echo './'`google-snappy/snappy.cc
libtool: compile:  g++ -DHAVE_CONFIG_H -I. -I../.. -I../../src/snappy/google-snappy -D_XOPEN_SOURCE
-I/opt/local/include -I/opt/local/include/js -I/usr/local/include -I/usr/local/include/js
-I/usr/include -I/usr/include/js -I/usr/local/lib/erlang/erts-5.9.1/include/ -g -O2 -MT snappy_nif_la-snappy.lo
-MD -MP -MF .deps/snappy_nif_la-snappy.Tpo -c google-snappy/snappy.cc  -fPIC -DPIC -o .libs/snappy_nif_la-snappy.o
mv -f .deps/snappy_nif_la-snappy.Tpo .deps/snappy_nif_la-snappy.Plo
/bin/sh ../../libtool  --tag=CXX   --mode=compile g++ -DHAVE_CONFIG_H -I. -I../.. -I../../src/snappy/google-snappy
  -D_XOPEN_SOURCE  -I/opt/local/include -I/opt/local/include/js -I/usr/local/include -I/usr/local/include/js
-I/usr/include -I/usr/include/js  -I/usr/local/lib/erlang/erts-5.9.1/include/  -g -O2 -MT
snappy_nif_la-snappy-sinksource.lo -MD -MP -MF .deps/snappy_nif_la-snappy-sinksource.Tpo -c
-o snappy_nif_la-snappy-sinksource.lo `test -f 'google-snappy/snappy-sinksource.cc' || echo
'./'`google-snappy/snappy-sinksource.cc
libtool: compile:  g++ -DHAVE_CONFIG_H -I. -I../.. -I../../src/snappy/google-snappy -D_XOPEN_SOURCE
-I/opt/local/include -I/opt/local/include/js -I/usr/local/include -I/usr/local/include/js
-I/usr/include -I/usr/include/js -I/usr/local/lib/erlang/erts-5.9.1/include/ -g -O2 -MT snappy_nif_la-snappy-sinksource.lo
-MD -MP -MF .deps/snappy_nif_la-snappy-sinksource.Tpo -c google-snappy/snappy-sinksource.cc
 -fPIC -DPIC -o .libs/snappy_nif_la-snappy-sinksource.o
mv -f .deps/snappy_nif_la-snappy-sinksource.Tpo .deps/snappy_nif_la-snappy-sinksource.Plo
/bin/sh ../../libtool  --tag=CXX   --mode=compile g++ -DHAVE_CONFIG_H -I. -I../.. -I../../src/snappy/google-snappy
  -D_XOPEN_SOURCE  -I/opt/local/include -I/opt/local/include/js -I/usr/local/include -I/usr/local/include/js
-I/usr/include -I/usr/include/js  -I/usr/local/lib/erlang/erts-5.9.1/include/  -g -O2 -MT
snappy_nif_la-snappy-stubs-internal.lo -MD -MP -MF .deps/snappy_nif_la-snappy-stubs-internal.Tpo
-c -o snappy_nif_la-snappy-stubs-internal.lo `test -f 'google-snappy/snappy-stubs-internal.cc'
|| echo './'`google-snappy/snappy-stubs-internal.cc
libtool: compile:  g++ -DHAVE_CONFIG_H -I. -I../.. -I../../src/snappy/google-snappy -D_XOPEN_SOURCE
-I/opt/local/include -I/opt/local/include/js -I/usr/local/include -I/usr/local/include/js
-I/usr/include -I/usr/include/js -I/usr/local/lib/erlang/erts-5.9.1/include/ -g -O2 -MT snappy_nif_la-snappy-stubs-internal.lo
-MD -MP -MF .deps/snappy_nif_la-snappy-stubs-internal.Tpo -c google-snappy/snappy-stubs-internal.cc
 -fPIC -DPIC -o .libs/snappy_nif_la-snappy-stubs-internal.o
mv -f .deps/snappy_nif_la-snappy-stubs-internal.Tpo .deps/snappy_nif_la-snappy-stubs-internal.Plo
/bin/sh ../../libtool --tag=CXX   --mode=link g++ -I/usr/local/lib/erlang/erts-5.9.1/include/
 -g -O2 -module -avoid-version  -L/opt/local/lib -L/usr/local/lib  -o snappy_nif.la -rpath
/usr/local/lib/couchdb/erlang/lib/snappy-1.0.3/priv snappy_nif_la-snappy_nif.lo snappy_nif_la-snappy.lo
snappy_nif_la-snappy-sinksource.lo snappy_nif_la-snappy-stubs-internal.lo  -L/opt/local/lib
-L/usr/local/lib  -lcrypt
libtool: link: g++  -fPIC -DPIC -shared -nostdlib /usr/lib/../lib64/crti.o /usr/local/lib/gcc/x86_64-unknown-linux-gnu/4.6.3/crtbeginS.o
 .libs/snappy_nif_la-snappy_nif.o .libs/snappy_nif_la-snappy.o .libs/snappy_nif_la-snappy-sinksource.o
.libs/snappy_nif_la-snappy-stubs-internal.o   -Wl,-rpath -Wl,/usr/local/lib/../lib -Wl,-rpath
-Wl,/usr/local/lib/../lib -L/opt/local/lib -L/usr/local/lib -lcrypt -L/usr/local/lib/gcc/x86_64-unknown-linux-gnu/4.6.3
-L/usr/local/lib/gcc/x86_64-unknown-linux-gnu/4.6.3/../../../../lib64 -L/lib/../lib64 -L/usr/lib/../lib64
-L/usr/local/lib/gcc/x86_64-unknown-linux-gnu/4.6.3/../../.. /usr/local/lib/../lib/libstdc++.so
-lm -lc -lgcc_s /usr/local/lib/gcc/x86_64-unknown-linux-gnu/4.6.3/crtendS.o /usr/lib/../lib64/crtn.o
 -O2   -Wl,-soname -Wl,snappy_nif.so -o .libs/snappy_nif.so
/usr/local/lib/../lib/libstdc++.so: could not read symbols: File in wrong format
collect2: ld returned 1 exit status
make[3]: *** [snappy_nif.la] Error 1
make[3]: Leaving directory `/home/idapp/apache-couchdb-1.3.0/src/snappy'
make[2]: *** [all-recursive] Error 1
make[2]: Leaving directory `/home/idapp/apache-couchdb-1.3.0/src'
make[1]: *** [all-recursive] Error 1
make[1]: Leaving directory `/home/idapp/apache-couchdb-1.3.0'
make: *** [all] Error 2


--
This message is automatically generated by JIRA.
If you think it was sent incorrectly, please contact your JIRA administrators
For more information on JIRA, see: http://www.atlassian.com/software/jira

Mime
View raw message