cordova-issues mailing list archives

Site index · List index
Message view « Date » · « Thread »
Top « Date » · « Thread »
From "ASF GitHub Bot (JIRA)" <j...@apache.org>
Subject [jira] [Commented] (CB-12465) Rewrite JUnit Tests
Date Fri, 24 Feb 2017 00:44:44 GMT

    [ https://issues.apache.org/jira/browse/CB-12465?page=com.atlassian.jira.plugin.system.issuetabpanels:comment-tabpanel&focusedCommentId=15881647#comment-15881647
] 

ASF GitHub Bot commented on CB-12465:
-------------------------------------

Github user fujunwei commented on the issue:

    https://github.com/apache/cordova-android/pull/363
  
    There is a test failed on SM-G9250.
    > org.apache.cordova.unittests.IFrameTest > iFrameHistory[SM-G9250 - 6.0.1] FAILED

    at junit.framework.Assert.fail(Assert.java:48)
    
    And there are two tests failed on Android Things platform.
    >  org.apache.cordova.unittests.BackButtonMultipageTest > testViaBackButtonOnView[iot_joule
- 7.0] FAILED  at android.support.test.espresso.NoActivityResumedException: No activities
in stage RESUMED. Did you forget to launch the activity. (test.getActivity() or similar)?
    
    > org.apache.cordova.unittests.IFrameTest > iFrameHistory[iot_joule - 7.0] FAILED
at android.support.test.espresso.NoActivityResumedException: No activities in stage RESUMED.
Did you forget to launch the activity. (test.getActivity() or similar)?


> Rewrite JUnit Tests
> -------------------
>
>                 Key: CB-12465
>                 URL: https://issues.apache.org/jira/browse/CB-12465
>             Project: Apache Cordova
>          Issue Type: Bug
>          Components: Android
>            Reporter: Joe Bowser
>            Assignee: Joe Bowser
>            Priority: Blocker
>




--
This message was sent by Atlassian JIRA
(v6.3.15#6346)

---------------------------------------------------------------------
To unsubscribe, e-mail: issues-unsubscribe@cordova.apache.org
For additional commands, e-mail: issues-help@cordova.apache.org


Mime
View raw message