continuum-users mailing list archives

Site index · List index
Message view « Date » · « Thread »
Top « Date » · « Thread »
From mfs <farhan.sar...@gmail.com>
Subject Re: Strange - Success icon shown and no emails sent in case of build-failure
Date Thu, 30 Aug 2007 21:34:04 GMT

Below is the stack-trace from the continuum log...i just tried uploading the
pom this time instead of providing the pom url...but still the same issue..

179243 [pool-2-thread-1] INFO 
org.apache.maven.continuum.scm.ContinuumScm:default  - Checking out project:
'Share : PDFP', id: '6' to
'C:\appl\continuum-1.1-beta-2\apps\continuum\webapp\WEB-INF\working-directory\6'.
179296 [pool-2-thread-1] INFO 
org.apache.maven.scm.manager.ScmManager:default  - Executing: cmd.exe /X /C
'"svn --non-interactive checkout http://localhost/svn/repos/pdfp 6"'
179296 [pool-2-thread-1] INFO 
org.apache.maven.scm.manager.ScmManager:default  - Working directory:
C:\appl\continuum-1.1-beta-2\apps\continuum\webapp\WEB-INF\working-directory
180009 [pool-2-thread-1] INFO 
org.apache.maven.continuum.scm.ContinuumScm:default  - Checked out 23 files.
190923 [SocketListener0-0] INFO 
org.apache.maven.continuum.Continuum:default  - Enqueuing 'Share : PDFP'
(Build definition id=6).
190933 [pool-1-thread-1] INFO 
org.apache.maven.continuum.buildcontroller.BuildController:default  -
Initializing build
190945 [pool-1-thread-1] INFO 
org.apache.maven.continuum.buildcontroller.BuildController:default  -
Starting build of Share : PDFP
190992 [pool-1-thread-1] INFO 
org.apache.maven.continuum.buildcontroller.BuildController:default  -
Updating working dir
190993 [pool-1-thread-1] INFO 
org.apache.maven.continuum.buildcontroller.BuildController:default  -
Performing action check-working-directory
190996 [pool-1-thread-1] INFO 
org.apache.maven.continuum.buildcontroller.BuildController:default  -
Performing action update-working-directory-from-scm
191015 [pool-1-thread-1] INFO 
org.apache.maven.continuum.scm.ContinuumScm:default  - Updating project: id:
'6', name 'Share : PDFP'.
191046 [pool-1-thread-1] INFO 
org.apache.maven.scm.manager.ScmManager:default  - Executing: cmd.exe /X /C
'"svn --non-interactive update"'
191046 [pool-1-thread-1] INFO 
org.apache.maven.scm.manager.ScmManager:default  - Working directory:
C:\appl\continuum-1.1-beta-2\apps\continuum\webapp\WEB-INF\working-directory\6
192035 [pool-1-thread-1] INFO 
org.apache.maven.continuum.buildcontroller.BuildController:default  -
Merging SCM results
192035 [pool-1-thread-1] INFO 
org.apache.maven.continuum.buildcontroller.BuildController:default  -
Changes found, building
192035 [pool-1-thread-1] INFO 
org.apache.maven.continuum.buildcontroller.BuildController:default  -
Performing action update-project-from-working-directory
192041 [pool-1-thread-1] INFO 
org.codehaus.plexus.action.Action:update-project-from-working-directory  -
Updating project 'Share : PDFP' from checkout.
192184 [pool-1-thread-1] INFO 
org.apache.maven.continuum.buildcontroller.BuildController:default  -
Performing action execute-builder
192276 [pool-1-thread-1] INFO 
org.apache.maven.continuum.utils.shell.ShellCommandHelper:default  -
Executing: cmd.exe /X /C '"C:\appl\maven-2.0.7\bin\mvn --batch-mode
--non-recursive -Dcontinuum.project.lastBuild.state=10
-Dcontinuum.project.nextBuild.number=1 "-Dcontinuum.project.group.name=Share
: PDFP" -Dcontinuum.project.lastBuild.number=0 clean install"'
192277 [pool-1-thread-1] INFO 
org.apache.maven.continuum.utils.shell.ShellCommandHelper:default  - Working
directory:
C:\appl\continuum-1.1-beta-2\apps\continuum\webapp\WEB-INF\working-directory\6
194410 [pool-1-thread-1] INFO 
org.apache.maven.continuum.execution.ContinuumBuildExecutor:maven2  - Exit
code: 0
194527 [pool-1-thread-1] INFO 
org.apache.maven.continuum.buildcontroller.BuildController:default  -
Performing action deploy-artifact
195015 [pool-1-thread-1] INFO 
org.codehaus.plexus.notification.notifier.Notifier:mail  - Sending message:
>From '"Continuum@dummyuser-PC" <fsarwar@vaudit.com>'.
195016 [pool-1-thread-1] INFO 
org.codehaus.plexus.notification.notifier.Notifier:mail  - Recipient: To
'<fsarwar@vaudit.com>'.
639714 [SocketListener0-0] INFO 
org.apache.maven.continuum.build.settings.SchedulesActivator:default  -
Unactivating schedule DEFAULT_SCHEDULE
639714 [SocketListener0-0] INFO 
org.apache.maven.continuum.build.settings.SchedulesActivator:default  -
Stopping active schedule "DEFAULT_SCHEDULE".
639714 [SocketListener0-0] INFO 
org.apache.maven.continuum.build.settings.SchedulesActivator:default  -
Activating schedule DEFAULT_SCHEDULE
639715 [SocketListener0-0] INFO 
org.apache.maven.continuum.build.settings.SchedulesActivator:default  -
DEFAULT_SCHEDULE: next fire time ->Thu Aug 30 14:25:00 PDT 2007
665793 [SocketListener0-1] INFO 
com.opensymphony.xwork.interceptor.Interceptor:exceptionLogging  - Error
ocurred during execution
java.io.FileNotFoundException: 6\pom.xml (The system cannot find the path
specified)
	at java.io.FileInputStream.open(Native Method)
	at java.io.FileInputStream.<init>(FileInputStream.java:106)
	at java.io.FileReader.<init>(FileReader.java:55)
	at
org.apache.maven.continuum.web.action.ReleasePrepareAction.getReleasePluginParameters(ReleasePrepareAction.java:128)
	at
org.apache.maven.continuum.web.action.ReleasePrepareAction.input(ReleasePrepareAction.java:117)
	at sun.reflect.NativeMethodAccessorImpl.invoke0(Native Method)
	at
sun.reflect.NativeMethodAccessorImpl.invoke(NativeMethodAccessorImpl.java:39)
	at
sun.reflect.DelegatingMethodAccessorImpl.invoke(DelegatingMethodAccessorImpl.java:25)
	at java.lang.reflect.Method.invoke(Method.java:585)
	at
com.opensymphony.xwork.DefaultActionInvocation.invokeAction(DefaultActionInvocation.java:364)
	at
com.opensymphony.xwork.DefaultActionInvocation.invokeActionOnly(DefaultActionInvocation.java:216)
	at
com.opensymphony.xwork.DefaultActionInvocation.invoke(DefaultActionInvocation.java:190)
	at
com.opensymphony.xwork.interceptor.MethodFilterInterceptor.intercept(MethodFilterInterceptor.java:88)
	at
com.opensymphony.xwork.DefaultActionInvocation.invoke(DefaultActionInvocation.java:188)
	at
com.opensymphony.xwork.interceptor.MethodFilterInterceptor.intercept(MethodFilterInterceptor.java:88)
	at
com.opensymphony.xwork.DefaultActionInvocation.invoke(DefaultActionInvocation.java:188)
	at
org.apache.maven.continuum.web.interceptor.ForceContinuumConfigurationInterceptor.intercept(ForceContinuumConfigurationInterceptor.java:72)
	at
com.opensymphony.xwork.DefaultActionInvocation.invoke(DefaultActionInvocation.java:188)
	at
org.codehaus.plexus.redback.xwork.interceptor.PolicyEnforcementInterceptor.intercept(PolicyEnforcementInterceptor.java:103)
	at
com.opensymphony.xwork.DefaultActionInvocation.invoke(DefaultActionInvocation.java:188)
	at
org.codehaus.plexus.redback.xwork.interceptor.SecureActionInterceptor.intercept(SecureActionInterceptor.java:178)
	at
com.opensymphony.xwork.DefaultActionInvocation.invoke(DefaultActionInvocation.java:188)
	at
org.codehaus.plexus.xwork.interceptor.ExceptionMappingInterceptor.intercept(ExceptionMappingInterceptor.java:58)
	at
com.opensymphony.xwork.DefaultActionInvocation.invoke(DefaultActionInvocation.java:188)
	at
com.opensymphony.xwork.interceptor.MethodFilterInterceptor.intercept(MethodFilterInterceptor.java:88)
	at
com.opensymphony.xwork.DefaultActionInvocation.invoke(DefaultActionInvocation.java:188)
	at
com.opensymphony.xwork.interceptor.MethodFilterInterceptor.intercept(MethodFilterInterceptor.java:88)
	at
com.opensymphony.xwork.DefaultActionInvocation.invoke(DefaultActionInvocation.java:188)
	at
com.opensymphony.xwork.interceptor.AroundInterceptor.intercept(AroundInterceptor.java:31)
	at
com.opensymphony.xwork.DefaultActionInvocation.invoke(DefaultActionInvocation.java:188)
	at
com.opensymphony.xwork.interceptor.AroundInterceptor.intercept(AroundInterceptor.java:31)
	at
com.opensymphony.xwork.DefaultActionInvocation.invoke(DefaultActionInvocation.java:188)
	at
com.opensymphony.xwork.interceptor.AroundInterceptor.intercept(AroundInterceptor.java:31)
	at
com.opensymphony.xwork.DefaultActionInvocation.invoke(DefaultActionInvocation.java:188)
	at
com.opensymphony.webwork.interceptor.FileUploadInterceptor.intercept(FileUploadInterceptor.java:171)
	at
com.opensymphony.xwork.DefaultActionInvocation.invoke(DefaultActionInvocation.java:188)
	at
com.opensymphony.xwork.interceptor.AroundInterceptor.intercept(AroundInterceptor.java:31)
	at
com.opensymphony.xwork.DefaultActionInvocation.invoke(DefaultActionInvocation.java:188)
	at
com.opensymphony.webwork.interceptor.debugging.DebuggingInterceptor.intercept(DebuggingInterceptor.java:147)
	at
com.opensymphony.xwork.DefaultActionInvocation.invoke(DefaultActionInvocation.java:188)
	at
com.opensymphony.xwork.interceptor.AroundInterceptor.intercept(AroundInterceptor.java:31)
	at
com.opensymphony.xwork.DefaultActionInvocation.invoke(DefaultActionInvocation.java:188)
	at
com.opensymphony.xwork.interceptor.I18nInterceptor.intercept(I18nInterceptor.java:151)
	at
com.opensymphony.xwork.DefaultActionInvocation.invoke(DefaultActionInvocation.java:188)
	at
com.opensymphony.xwork.interceptor.AroundInterceptor.intercept(AroundInterceptor.java:31)
	at
com.opensymphony.xwork.DefaultActionInvocation.invoke(DefaultActionInvocation.java:188)
	at
com.opensymphony.xwork.interceptor.AroundInterceptor.intercept(AroundInterceptor.java:31)
	at
com.opensymphony.xwork.DefaultActionInvocation.invoke(DefaultActionInvocation.java:188)
	at
com.opensymphony.xwork.interceptor.AroundInterceptor.intercept(AroundInterceptor.java:31)
	at
com.opensymphony.xwork.DefaultActionInvocation.invoke(DefaultActionInvocation.java:188)
	at
com.opensymphony.xwork.interceptor.ExceptionMappingInterceptor.intercept(ExceptionMappingInterceptor.java:186)
	at
com.opensymphony.xwork.DefaultActionInvocation.invoke(DefaultActionInvocation.java:188)
	at
org.codehaus.plexus.redback.xwork.interceptor.AutoLoginInterceptor.intercept(AutoLoginInterceptor.java:156)
	at
com.opensymphony.xwork.DefaultActionInvocation.invoke(DefaultActionInvocation.java:188)
	at
org.codehaus.plexus.redback.xwork.interceptor.ForceAdminUserInterceptor.intercept(ForceAdminUserInterceptor.java:63)
	at
com.opensymphony.xwork.DefaultActionInvocation.invoke(DefaultActionInvocation.java:188)
	at
org.codehaus.plexus.redback.xwork.interceptor.EnvironmentCheckInterceptor.intercept(EnvironmentCheckInterceptor.java:122)
	at
com.opensymphony.xwork.DefaultActionInvocation.invoke(DefaultActionInvocation.java:188)
	at
com.opensymphony.xwork.DefaultActionProxy.execute(DefaultActionProxy.java:113)
	at
com.opensymphony.webwork.dispatcher.DispatcherUtils.serviceAction(DispatcherUtils.java:225)
	at
com.opensymphony.webwork.dispatcher.FilterDispatcher.doFilter(FilterDispatcher.java:202)
	at
org.mortbay.jetty.servlet.WebApplicationHandler$CachedChain.doFilter(WebApplicationHandler.java:821)
	at
com.opensymphony.module.sitemesh.filter.PageFilter.parsePage(PageFilter.java:118)
	at
com.opensymphony.module.sitemesh.filter.PageFilter.doFilter(PageFilter.java:52)
	at
org.mortbay.jetty.servlet.WebApplicationHandler$CachedChain.doFilter(WebApplicationHandler.java:821)
	at
com.opensymphony.webwork.dispatcher.ActionContextCleanUp.doFilter(ActionContextCleanUp.java:88)
	at
org.mortbay.jetty.servlet.WebApplicationHandler$CachedChain.doFilter(WebApplicationHandler.java:821)
	at
org.mortbay.jetty.servlet.WebApplicationHandler.dispatch(WebApplicationHandler.java:471)
	at org.mortbay.jetty.servlet.ServletHandler.handle(ServletHandler.java:568)
	at org.mortbay.http.HttpContext.handle(HttpContext.java:1530)
	at
org.mortbay.jetty.servlet.WebApplicationContext.handle(WebApplicationContext.java:633)
	at org.mortbay.http.HttpContext.handle(HttpContext.java:1482)
	at org.mortbay.http.HttpServer.service(HttpServer.java:909)
	at org.mortbay.http.HttpConnection.service(HttpConnection.java:816)
	at org.mortbay.http.HttpConnection.handleNext(HttpConnection.java:982)
	at org.mortbay.http.HttpConnection.handle(HttpConnection.java:833)
	at
org.mortbay.http.SocketListener.handleConnection(SocketListener.java:244)
	at org.mortbay.util.ThreadedServer.handle(ThreadedServer.java:357)
	at org.mortbay.util.ThreadPool$PoolThread.run(ThreadPool.java:534)


mfs wrote:
> 
> Dear All,
> 
> I am getting this strange behavior where even on a build-failure (as
> below) as shown in the Result, the success icon is shown against the
> project on "show-project" screen and same is the case with history screen
> against a project...and even no emails are sent as its intrepreting that
> the build is a success (dont know why) and no state change since last
> build..
> 
> [INFO] Scanning for projects...
> [INFO]
> ----------------------------------------------------------------------------
> [INFO] Building Share : PDFP
> [INFO]    task-segment: [clean, install]
> [INFO]
> ----------------------------------------------------------------------------
> [INFO] [clean:clean]
> [INFO] Deleting directory C:\continuum\continuum_wd\8\target
> [INFO] Deleting directory C:\continuum\continuum_wd\8\target\classes
> [INFO] Deleting directory C:\continuum\continuum_wd\8\target\test-classes
> [INFO] Deleting directory C:\continuum\continuum_wd\8\target\site
> [INFO] [resources:resources]
> [INFO] Using default encoding to copy filtered resources.
> [INFO] [compiler:compile]
> [INFO] Compiling 18 source files to
> C:\continuum\continuum_wd\8\target\classes
> [INFO]
> ------------------------------------------------------------------------
> [ERROR] BUILD FAILURE
> [INFO]
> ------------------------------------------------------------------------
> [INFO] Compilation failure
> C:\continuum\continuum_wd\8\src\main\java\vaudit\pdfp\PdfField.java:[1,0]
> 'class' or 'interface' expected
> 
> 
> 
> C:\continuum\continuum_wd\8\src\main\java\vaudit\pdfp\PdfField.java:[1,0]
> 'class' or 'interface' expected
> 
> 
> [INFO]
> ------------------------------------------------------------------------
> [INFO] For more information, run Maven with the -e switch
> [INFO]
> ------------------------------------------------------------------------
> [INFO] Total time: 1 second
> [INFO] Finished at: Thu Aug 30 11:01:50 PDT 2007
> [INFO] Final Memory: 4M/8M
> [INFO]
> ------------------------------------------------------------------------
> 
> 

-- 
View this message in context: http://www.nabble.com/Strange---Success-icon-shown-and-no-emails-sent-in-case-of-build-failure-tf4355976.html#a12416581
Sent from the Continuum - Users mailing list archive at Nabble.com.


Mime
View raw message