continuum-users mailing list archives

Site index · List index
Message view « Date » · « Thread »
Top « Date » · « Thread »
From Emmanuel Venisse <emman...@venisse.net>
Subject Re: continuum build fails
Date Thu, 06 Apr 2006 15:15:32 GMT
I don't have the name of test in your log?
The name of test is in the line that start by [surefire] Running org.apache.maven.continuum.it
few 
lines above the "<<<<<<< Failure message", but if you open txt files
in 
continuum-core-it/target/surefire-reports directory, it will more easy to find the test in
failure

Emmanuel

Dixit, Sandeep (ProSource Solutions) a écrit :
> See my log below. It does have <<<<<<<< FAILURE in it. Just doesn't
have a detailed message. Do I need to run with -e option?
> 
> Thanks,
> Sandeep
> 
> -----Original Message-----
> From: Emmanuel Venisse [mailto:emmanuel@venisse.net] 
> Sent: Thursday, April 06, 2006 9:05 AM
> To: continuum-users@maven.apache.org
> Subject: Re: continuum build fails
> 
> In console, you must have a line with "<<<<<<<< FAILURE !!" or
you can look in 
> continuum-core-it/target/surefire-reports
> 
> Emmanuel
> 
> Dixit, Sandeep (ProSource Solutions) a écrit :
> 
>>Where does it write the log? I am not able to find it in the continuum directory where
I checked out the code and doing the build.
>>
>>Thanks,
>>Sandeep
>>
>>-----Original Message-----
>>From: Emmanuel Venisse [mailto:emmanuel@venisse.net] 
>>Sent: Wednesday, April 05, 2006 4:03 PM
>>To: continuum-users@maven.apache.org
>>Subject: Re: continuum build fails
>>
>>what is the test that failed?
>>
>>Emmanuel
>>
>>Dixit, Sandeep (ProSource Solutions) a écrit :
>>
>>
>>>I am getting the following error message while trying to build on winxp
>>>machine. How do I resolve this?
>>>
>>>Thanks in advance,
>>>Sandeep
>>>
>>>
>>>------------------------------------------------------------------------
>>>-------
>>>[2006.04.05 14:55:39] Integration test settings
>>>------------------------------------------------------------------------
>>>-------
>>>[2006.04.05 14:55:39] IT root: C:\continuum\continuum-core-it\target\it
>>>[2006.04.05 14:55:39] Remoting method: jvm
>>>[2006.04.05 14:55:39] Store implementation: class
>>>org.apache.maven.continuum.sto
>>>re.JdoContinuumStore
>>>------------------------------------------------------------------------
>>>-------
>>>[surefire] Tests run: 1, Failures: 0, Errors: 1, Time elapsed: 7.938 sec
>>><<<<<<<
>>>< FAILURE !!
>>>[INFO]
>>>------------------------------------------------------------------------
>>>[ERROR] BUILD ERROR
>>>[INFO]
>>>------------------------------------------------------------------------
>>>[INFO] There are test failures.
>>>[INFO]
>>>------------------------------------------------------------------------
>>>[INFO] For more information, run Maven with the -e switch
>>>[INFO]
>>>------------------------------------------------------------------------
>>>[INFO] Total time: 7 minutes 5 seconds
>>>[INFO] Finished at: Wed Apr 05 14:55:39 EDT 2006
>>>[INFO] Final Memory: 60M/63M
>>>[INFO]
>>>------------------------------------------------------------------------
>>>
>>>-------------------------------------------------------------------------------------------
>>>***National City made the following annotations
>>>-------------------------------------------------------------------------------------------
>>>This communication is a confidential and proprietary business communication. 

>>>It is intended solely for the use of the designated recipient(s).  If this
>>>communication is received in error, please contact the sender and delete 
>>>this communication.
>>>===========================================================================================
>>>
>>>
>>>
>>
>>
>>
>>
>>
>>
>>
> 
> 
> 
> 
> 
> 


Mime
View raw message