continuum-users mailing list archives

Site index · List index
Message view « Date » · « Thread »
Top « Date » · « Thread »
From "Dixit, Sandeep (ProSource Solutions)" <Sandeep.Di...@contractors.nationalcity.com>
Subject RE: continuum build fails
Date Thu, 06 Apr 2006 15:14:08 GMT
Here is log from today's build... 


2006-04-06 11:12:12,974 [main] INFO  SCHEMA                         - Catalog ""
, Schema "SA" initialised - managing 26 classes
2006-04-06 11:12:13,489 [main] INFO  Continuum                      -  6:Ant CVS
 Project:ant
2006-04-06 11:12:13,489 [main] INFO  Continuum                      - Starting C
ontinuum.
2006-04-06 11:12:13,489 [main] INFO  Continuum                      -
2006-04-06 11:12:13,489 [main] INFO  Continuum                      -
2006-04-06 11:12:13,489 [main] INFO  Continuum                      - < Continuu
m 1.1-SNAPSHOT started! >
2006-04-06 11:12:13,489 [main] INFO  Continuum                      - ----------
-------------------------
2006-04-06 11:12:13,489 [main] INFO  Continuum                      -        \
 ^__^
2006-04-06 11:12:13,489 [main] INFO  Continuum                      -         \
 (oo)\_______
2006-04-06 11:12:13,489 [main] INFO  Continuum                      -
 (__)\       )\/\
2006-04-06 11:12:13,489 [main] INFO  Continuum                      -
     ||----w |
2006-04-06 11:12:13,489 [main] INFO  Continuum                      -
     ||     ||
2006-04-06 11:12:13,489 [main] INFO  Continuum                      -
2006-04-06 11:12:13,489 [main] INFO  Continuum                      -
2006-04-06 11:12:13,489 [main] INFO  ContinuumInitializer           - Continuum
initializer running ...
2006-04-06 11:12:15,739 [main] INFO  SchedulesActivator             - Activating
 schedules ...
2006-04-06 11:12:15,755 [main] WARN  ContinuumScheduler             - Will not s
chedule this job as a job {DEFAULT_SCHEDULE:DEFAULT} already exists.
2006-04-06 11:12:15,755 [main] INFO  SchedulesActivator             - null
2006-04-06 11:12:15,755 [main] INFO  PlexusContainer                - Loading on
 start [role,roleHint]: [org.codehaus.plexus.taskqueue.execution.TaskQueueExecut
or,build-project]
2006-04-06 11:12:15,755 [main] WARN  RecipientSource                - Using '${m
ail.override.to.address}' as the to address for all emails.
2006-04-06 11:12:15,755 [main] INFO  TaskQueueExecutor:build-project - Starting
task executor, thread name 'build-project'.
2006-04-06 11:12:15,755 [main] INFO  PlexusContainer                - Loading on
 start [role,roleHint]: [org.codehaus.plexus.taskqueue.execution.TaskQueueExecut
or,check-out-project]
2006-04-06 11:12:15,755 [main] INFO  TaskQueueExecutor:check-out-project - Start
ing task executor, thread name 'check-out-project'.
-------------------------------------------------------------------------------
[2006.04.06 11:12:15] Integration test settings
-------------------------------------------------------------------------------
[2006.04.06 11:12:15] IT root: C:\svnmvn\maven\continuum\continuum-core-it\targe
t\it
[2006.04.06 11:12:15] Remoting method: jvm
[2006.04.06 11:12:15] Store implementation: class org.apache.maven.continuum.sto
re.JdoContinuumStore
-------------------------------------------------------------------------------
[surefire] Tests run: 1, Failures: 0, Errors: 1, Time elapsed: 16.499 sec <<<<<<
<< FAILURE !!
[INFO] ------------------------------------------------------------------------
[ERROR] BUILD ERROR
[INFO] ------------------------------------------------------------------------
[INFO] There are test failures.
[INFO] ------------------------------------------------------------------------
[INFO] For more information, run Maven with the -e switch
[INFO] ------------------------------------------------------------------------
[INFO] Total time: 7 minutes 33 seconds
[INFO] Finished at: Thu Apr 06 11:12:16 EDT 2006
[INFO] Final Memory: 61M/63M
[INFO] ------------------------------------------------------------------------

-----Original Message-----
From: Emmanuel Venisse [mailto:emmanuel@venisse.net] 
Sent: Thursday, April 06, 2006 9:05 AM
To: continuum-users@maven.apache.org
Subject: Re: continuum build fails

In console, you must have a line with "<<<<<<<< FAILURE !!" or you
can look in 
continuum-core-it/target/surefire-reports

Emmanuel

Dixit, Sandeep (ProSource Solutions) a écrit :
> Where does it write the log? I am not able to find it in the continuum directory where
I checked out the code and doing the build.
> 
> Thanks,
> Sandeep
> 
> -----Original Message-----
> From: Emmanuel Venisse [mailto:emmanuel@venisse.net] 
> Sent: Wednesday, April 05, 2006 4:03 PM
> To: continuum-users@maven.apache.org
> Subject: Re: continuum build fails
> 
> what is the test that failed?
> 
> Emmanuel
> 
> Dixit, Sandeep (ProSource Solutions) a écrit :
> 
>>I am getting the following error message while trying to build on winxp
>>machine. How do I resolve this?
>>
>>Thanks in advance,
>>Sandeep
>>
>>
>>------------------------------------------------------------------------
>>-------
>>[2006.04.05 14:55:39] Integration test settings
>>------------------------------------------------------------------------
>>-------
>>[2006.04.05 14:55:39] IT root: C:\continuum\continuum-core-it\target\it
>>[2006.04.05 14:55:39] Remoting method: jvm
>>[2006.04.05 14:55:39] Store implementation: class
>>org.apache.maven.continuum.sto
>>re.JdoContinuumStore
>>------------------------------------------------------------------------
>>-------
>>[surefire] Tests run: 1, Failures: 0, Errors: 1, Time elapsed: 7.938 sec
>><<<<<<<
>>< FAILURE !!
>>[INFO]
>>------------------------------------------------------------------------
>>[ERROR] BUILD ERROR
>>[INFO]
>>------------------------------------------------------------------------
>>[INFO] There are test failures.
>>[INFO]
>>------------------------------------------------------------------------
>>[INFO] For more information, run Maven with the -e switch
>>[INFO]
>>------------------------------------------------------------------------
>>[INFO] Total time: 7 minutes 5 seconds
>>[INFO] Finished at: Wed Apr 05 14:55:39 EDT 2006
>>[INFO] Final Memory: 60M/63M
>>[INFO]
>>------------------------------------------------------------------------
>>
>>-------------------------------------------------------------------------------------------
>>***National City made the following annotations
>>-------------------------------------------------------------------------------------------
>>This communication is a confidential and proprietary business communication.  
>>It is intended solely for the use of the designated recipient(s).  If this
>>communication is received in error, please contact the sender and delete 
>>this communication.
>>===========================================================================================
>>
>>
>>
> 
> 
> 
> 
> 
> 
> 




Mime
View raw message