continuum-notifications mailing list archives

Site index · List index
Message view « Date » · « Thread »
Top « Date » · « Thread »
From Apache Continuum <...@continuum.apache.org>
Subject [continuum] BUILD FAILURE: Continuum :: Project - Continuum (trunk) ()
Date Sun, 12 Apr 2015 14:11:04 GMT
Online report : https://continuum-ci.apache.org/continuum/buildResult.action?buildId=39706&projectId=11

Build statistics:
  State: Failed
  Previous State: Failed
  Started at: Sun 12 Apr 2015 14:01:07 +0000
  Finished at: Sun 12 Apr 2015 14:11:01 +0000
  Total time: 9m 54s
  Build Trigger: Schedule
  Build Number: 272
  Exit code: 1
  Building machine hostname: continuum-vm
  Operating system : Linux(unknown)
  Java Home version : 
          java version "1.6.0_34"
          OpenJDK Runtime Environment (IcedTea6 1.13.6) (6b34-1.13.6-1ubuntu0.12.04.1)
          OpenJDK 64-Bit Server VM (build 23.25-b01, mixed mode)
        
  Builder version :
          Apache Maven 3.0.5 (r01de14724cdef164cd33c7c8c2fe155faf9602da; 2013-02-19 13:51:28+0000)
          Maven home: /opt/apache-maven-3.0.5
          Java version: 1.6.0_34, vendor: Sun Microsystems Inc.
          Java home: /usr/lib/jvm/java-6-openjdk-amd64/jre
          Default locale: en_US, platform encoding: ANSI_X3.4-1968
          OS name: "linux", version: "3.2.0-75-generic", arch: "amd64", family: "unix"
    
****************************************************************************
SCM Changes:
****************************************************************************
Changed: batkinson @ Sun 12 Apr 2015 13:43:11 +0000
Comment: [CONTINUUM-2745] Converted remaining tests to junit 4
Files changed:
  /continuum/trunk/continuum-base/continuum-configuration/pom.xml ( 1673010 )
  /continuum/trunk/continuum-base/continuum-configuration/src/test/java/org/apache/continuum/configuration/TestDefaultContinuumConfiguration.java
( 1673010 )
  /continuum/trunk/continuum-buildagent/continuum-buildagent-core/pom.xml ( 1673010 )
  /continuum/trunk/continuum-buildagent/continuum-buildagent-core/src/test/java/org/apache/continuum/buildagent/build/execution/maven/m2/DefaultBuildAgentMavenBuilderHelperTest.java
( 1673010 )
  /continuum/trunk/continuum-buildagent/continuum-buildagent-core/src/test/java/org/apache/continuum/buildagent/configuration/BuildAgentConfigurationTest.java
( 1673010 )
  /continuum/trunk/continuum-buildagent/continuum-buildagent-core/src/test/java/org/apache/continuum/buildagent/manager/BuildAgentPurgeManagerTest.java
( 1673010 )
  /continuum/trunk/continuum-buildagent/continuum-buildagent-core/src/test/java/org/apache/continuum/buildagent/manager/BuildAgentReleaseManagerTest.java
( 1673010 )
  /continuum/trunk/continuum-buildagent/continuum-buildagent-core/src/test/java/org/apache/continuum/buildagent/taskqueue/execution/BuildProjectTaskExecutorTest.java
( 1673010 )
  /continuum/trunk/continuum-buildagent/continuum-buildagent-webdav/pom.xml ( 1673010 )
  /continuum/trunk/continuum-buildagent/continuum-buildagent-webdav/src/test/java/org/apache/continuum/webdav/ContinuumBuildAgentDavResourceFactoryTest.java
( 1673010 )
  /continuum/trunk/continuum-buildagent/continuum-buildagent-webdav/src/test/java/org/apache/continuum/webdav/ContinuumBuildAgentDavResourceTest.java
( 1673010 )
  /continuum/trunk/continuum-buildagent/continuum-buildagent-webdav/src/test/java/org/apache/continuum/webdav/WorkingCopyServletTest.java
( 1673010 )
  /continuum/trunk/continuum-commons/src/test/java/org/apache/continuum/installation/DefaultInstallationServiceTest.java
( 1673010 )
  /continuum/trunk/continuum-commons/src/test/java/org/apache/continuum/profile/DefaultProfileServiceTest.java
( 1673010 )
  /continuum/trunk/continuum-commons/src/test/java/org/apache/maven/continuum/configuration/ConfigurationServiceTest.java
( 1673010 )
  /continuum/trunk/continuum-commons/src/test/java/org/apache/maven/continuum/utils/ContinuumUrlValidatorTest.java
( 1673010 )
  /continuum/trunk/continuum-commons/src/test/java/org/apache/maven/continuum/utils/DefaultWorkingDirectoryServiceTest.java
( 1673010 )
  /continuum/trunk/continuum-core/src/test/java/org/apache/continuum/builder/distributed/manager/DefaultDistributedBuildManagerTest.java
( 1673010 )
  /continuum/trunk/continuum-core/src/test/java/org/apache/continuum/builder/distributed/work/DefaultBuildStatusUpdaterTest.java
( 1673010 )
  /continuum/trunk/continuum-core/src/test/java/org/apache/continuum/buildmanager/ParallelBuildsManagerTest.java
( 1673010 )
  /continuum/trunk/continuum-core/src/test/java/org/apache/continuum/purge/AbstractPurgeTest.java
( 1673010 )
  /continuum/trunk/continuum-core/src/test/java/org/apache/continuum/purge/DefaultContinuumPurgeManagerTest.java
( 1673010 )
  /continuum/trunk/continuum-core/src/test/java/org/apache/continuum/purge/DefaultPurgeConfigurationServiceTest.java
( 1673010 )
  /continuum/trunk/continuum-core/src/test/java/org/apache/continuum/purge/executor/AbstractPurgeExecutorTest.java
( 1673010 )
  /continuum/trunk/continuum-core/src/test/java/org/apache/continuum/purge/executor/CleanAllPurgeExecutorTest.java
( 1673010 )
  /continuum/trunk/continuum-core/src/test/java/org/apache/continuum/purge/executor/DaysOldDirectoryPurgeExecutorTest.java
( 1673010 )
  /continuum/trunk/continuum-core/src/test/java/org/apache/continuum/purge/executor/DaysOldRepositoryPurgeExecutorTest.java
( 1673010 )
  /continuum/trunk/continuum-core/src/test/java/org/apache/continuum/purge/executor/ReleasedSnapshotsRepositoryPurgeExecutorTest.java
( 1673010 )
  /continuum/trunk/continuum-core/src/test/java/org/apache/continuum/purge/executor/RetentionCountDirectoryPurgeExecutorTest.java
( 1673010 )
  /continuum/trunk/continuum-core/src/test/java/org/apache/continuum/purge/executor/RetentionCountRepositoryPurgeExecutorTest.java
( 1673010 )
  /continuum/trunk/continuum-core/src/test/java/org/apache/continuum/release/distributed/manager/DefaultDistributedReleaseManagerTest.java
( 1673010 )
  /continuum/trunk/continuum-core/src/test/java/org/apache/continuum/repository/DefaultRepositoryServiceTest.java
( 1673010 )
  /continuum/trunk/continuum-core/src/test/java/org/apache/continuum/taskqueue/DefaultOverallBuildQueueTest.java
( 1673010 )
  /continuum/trunk/continuum-core/src/test/java/org/apache/maven/continuum/AddMaven2ProjectTest.java
( 1673010 )
  /continuum/trunk/continuum-core/src/test/java/org/apache/maven/continuum/AddProjectTest.java
( 1673010 )
  /continuum/trunk/continuum-core/src/test/java/org/apache/maven/continuum/DefaultContinuumTest.java
( 1673010 )
  /continuum/trunk/continuum-core/src/test/java/org/apache/maven/continuum/buildcontroller/BuildProjectTaskExecutorTest.java
( 1673010 )
  /continuum/trunk/continuum-core/src/test/java/org/apache/maven/continuum/buildcontroller/DefaultBuildControllerTest.java
( 1673010 )
  /continuum/trunk/continuum-core/src/test/java/org/apache/maven/continuum/builddefinition/DefaultBuildDefinitionServiceTest.java
( 1673010 )
  /continuum/trunk/continuum-core/src/test/java/org/apache/maven/continuum/buildqueue/BuildQueueTest.java
( 1673010 )
  /continuum/trunk/continuum-core/src/test/java/org/apache/maven/continuum/execution/manager/DefaultBuildExecutorManagerTest.java
( 1673010 )
  /continuum/trunk/continuum-core/src/test/java/org/apache/maven/continuum/execution/maven/m1/MavenOneBuildExecutorTest.java
( 1673010 )
  /continuum/trunk/continuum-core/src/test/java/org/apache/maven/continuum/execution/maven/m2/MavenTwoBuildExecutorTest.java
( 1673010 )
  /continuum/trunk/continuum-core/src/test/java/org/apache/maven/continuum/execution/maven/m2/TestMavenBuilderHelper.java
( 1673010 )
  /continuum/trunk/continuum-core/src/test/java/org/apache/maven/continuum/initialization/DefaultContinuumInitializerTest.java
( 1673010 )
  /continuum/trunk/continuum-core/src/test/java/org/apache/maven/continuum/notification/ContinuumNotificationDispatcherTest.java
( 1673010 )
  /continuum/trunk/continuum-core/src/test/java/org/apache/maven/continuum/notification/mail/MailContinuumNotifierTest.java
( 1673010 )
  /continuum/trunk/continuum-core/src/test/java/org/apache/maven/continuum/project/builder/maven/MavenOneContinuumProjectBuilderTest.java
( 1673010 )
  /continuum/trunk/continuum-core/src/test/java/org/apache/maven/continuum/project/builder/maven/MavenTwoContinuumProjectBuilderTest.java
( 1673010 )
  /continuum/trunk/continuum-core/src/test/java/org/apache/maven/continuum/scm/queue/PrepareBuildProjectsTaskExecutorTest.java
( 1673010 )
  /continuum/trunk/continuum-data-management/data-management-jdo/pom.xml ( 1673010 )
  /continuum/trunk/continuum-data-management/data-management-jdo/src/test/java/org/apache/maven/continuum/management/DataManagementToolTest.java
( 1673010 )
  /continuum/trunk/continuum-notifiers/continuum-notifier-wagon/pom.xml ( 1673010 )
  /continuum/trunk/continuum-notifiers/continuum-notifier-wagon/src/test/java/org/apache/maven/continuum/wagon/WagonContinuumNotifierTest.java
( 1673010 )
  /continuum/trunk/continuum-release/pom.xml ( 1673010 )
  /continuum/trunk/continuum-release/src/test/java/org/apache/maven/continuum/release/executors/ReleaseTaskExecutorTest.java
( 1673010 )
  /continuum/trunk/continuum-release/src/test/java/org/apache/maven/continuum/release/phase/UpdateWorkingCopyPhaseTest.java
( 1673010 )
  /continuum/trunk/continuum-reports/src/test/java/org/apache/maven/continuum/reports/surefire/DefaultReportTestSuiteGeneratorTest.java
( 1673010 )
  /continuum/trunk/continuum-store/src/test/java/org/apache/maven/continuum/store/AbstractContinuumStoreTestCase.java
( 1673010 )
  /continuum/trunk/continuum-store/src/test/java/org/apache/maven/continuum/store/ContinuumStoreTest.java
( 1673010 )
  /continuum/trunk/continuum-test/src/main/java/org/apache/maven/continuum/AbstractContinuumTest.java
( 1673010 )
  /continuum/trunk/continuum-test/src/main/java/org/apache/maven/continuum/PlexusSpringTestCase.java
( 1673010 )
  /continuum/trunk/continuum-webapp/pom.xml ( 1673010 )
  /continuum/trunk/continuum-webapp/src/test/java/org/apache/maven/continuum/web/action/ContinuumActionLoggingTest.java
( 1673010 )
  /continuum/trunk/continuum-xmlrpc/continuum-xmlrpc-server/pom.xml ( 1673010 )
  /continuum/trunk/continuum-xmlrpc/continuum-xmlrpc-server/src/test/java/org/apache/continuum/xmlrpc/server/ContinuumServiceImplTest.java
( 1673010 )

****************************************************************************
Dependencies Changes:
****************************************************************************
No dependencies changed


****************************************************************************
Build Definition:
****************************************************************************
POM filename: pom.xml
Goals: clean deploy   
Arguments: --batch-mode
Build Fresh: false
Always Build: false
Default Build Definition: true
Schedule: DEFAULT_SCHEDULE
Profile Name: Maven 3.0.5
Description: 

****************************************************************************
Test Summary:
****************************************************************************
Tests: 375
Failures: 1
Errors: 0
Success Rate: 99
Total time: 549.228

****************************************************************************
Test Failures:
****************************************************************************

DefaultRepositoryServiceTest
    testRemoveRepository :
  java.lang.AssertionError
  java.lang.AssertionError: check # repositories expected:<1> but was:<2>
	at org.junit.Assert.fail(Assert.java:88)
	at org.junit.Assert.failNotEquals(Assert.java:834)
	at org.junit.Assert.assertEquals(Assert.java:645)
	at org.apache.continuum.repository.DefaultRepositoryServiceTest.setupDefaultRepository(DefaultRepositoryServiceTest.java:90)
	at org.apache.continuum.repository.DefaultRepositoryServiceTest.setUp(DefaultRepositoryServiceTest.java:53)
	at sun.reflect.NativeMethodAccessorImpl.invoke0(Native Method)
	at sun.reflect.NativeMethodAccessorImpl.invoke(NativeMethodAccessorImpl.java:57)
	at sun.reflect.DelegatingMethodAccessorImpl.invoke(DelegatingMethodAccessorImpl.java:43)
	at java.lang.reflect.Method.invoke(Method.java:622)
	at org.junit.runners.model.FrameworkMethod$1.runReflectiveCall(FrameworkMethod.java:50)
	at org.junit.internal.runners.model.ReflectiveCallable.run(ReflectiveCallable.java:12)
	at org.junit.runners.model.FrameworkMethod.invokeExplosively(FrameworkMethod.java:47)
	at org.junit.internal.runners.statements.RunBefores.evaluate(RunBefores.java:24)
	at org.junit.internal.runners.statements.RunAfters.evaluate(RunAfters.java:27)
	at org.junit.rules.TestWatcher$1.evaluate(TestWatcher.java:55)
	at org.junit.rules.RunRules.evaluate(RunRules.java:20)
	at org.junit.runners.ParentRunner.runLeaf(ParentRunner.java:325)
	at org.junit.runners.BlockJUnit4ClassRunner.runChild(BlockJUnit4ClassRunner.java:78)
	at org.junit.runners.BlockJUnit4ClassRunner.runChild(BlockJUnit4ClassRunner.java:57)
	at org.junit.runners.ParentRunner$3.run(ParentRunner.java:290)
	at org.junit.runners.ParentRunner$1.schedule(ParentRunner.java:71)
	at org.junit.runners.ParentRunner.runChildren(ParentRunner.java:288)
	at org.junit.runners.ParentRunner.access$000(ParentRunner.java:58)
	at org.junit.runners.ParentRunner$2.evaluate(ParentRunner.java:268)
	at org.junit.runners.ParentRunner.run(ParentRunner.java:363)
	at org.apache.maven.surefire.junit4.JUnit4Provider.execute(JUnit4Provider.java:236)
	at org.apache.maven.surefire.junit4.JUnit4Provider.executeTestSet(JUnit4Provider.java:134)
	at org.apache.maven.surefire.junit4.JUnit4Provider.invoke(JUnit4Provider.java:113)
	at sun.reflect.NativeMethodAccessorImpl.invoke0(Native Method)
	at sun.reflect.NativeMethodAccessorImpl.invoke(NativeMethodAccessorImpl.java:57)
	at sun.reflect.DelegatingMethodAccessorImpl.invoke(DelegatingMethodAccessorImpl.java:43)
	at java.lang.reflect.Method.invoke(Method.java:622)
	at org.apache.maven.surefire.util.ReflectionUtils.invokeMethodWithArray(ReflectionUtils.java:189)
	at org.apache.maven.surefire.booter.ProviderFactory$ProviderProxy.invoke(ProviderFactory.java:165)
	at org.apache.maven.surefire.booter.ProviderFactory.invokeProvider(ProviderFactory.java:85)
	at org.apache.maven.surefire.booter.ForkedBooter.runSuitesInProcess(ForkedBooter.java:103)
	at org.apache.maven.surefire.booter.ForkedBooter.main(ForkedBooter.java:74)

  


Mime
View raw message