continuum-notifications mailing list archives: March 2010

Site index · List index
Message list1 · 2 · 3 · 4 · Next »Thread · Author · Date
[continuum] BUILD ERROR: Continuum 1.3.X - Continuum :: Project - default maven2 buildDefinition
Contin...@vmbuild.apache.org   [continuum] BUILD ERROR: Continuum 1.3.X - Continuum :: Project - default maven2 buildDefinition Sun, 07 Mar, 05:36
Contin...@vmbuild.apache.org   [continuum] BUILD ERROR: Continuum 1.3.X - Continuum :: Project - default maven2 buildDefinition Sun, 07 Mar, 09:31
Contin...@vmbuild.apache.org   [continuum] BUILD ERROR: Continuum 1.3.X - Continuum :: Project - default maven2 buildDefinition Sun, 07 Mar, 13:02
Contin...@vmbuild.apache.org   [continuum] BUILD ERROR: Continuum 1.3.X - Continuum :: Project - default maven2 buildDefinition Sun, 07 Mar, 16:02
Contin...@vmbuild.apache.org   [continuum] BUILD ERROR: Continuum 1.3.X - Continuum :: Project - default maven2 buildDefinition Sun, 07 Mar, 18:32
Contin...@vmbuild.apache.org   [continuum] BUILD ERROR: Continuum 1.3.X - Continuum :: Project - default maven2 buildDefinition Sun, 07 Mar, 20:32
Contin...@vmbuild.apache.org   [continuum] BUILD ERROR: Continuum 1.3.X - Continuum :: Project - default maven2 buildDefinition Sun, 07 Mar, 22:16
[continuum] BUILD FAILURE: Continuum 1.3.X - Continuum :: Project - default maven2 buildDefinition
Contin...@vmbuild.apache.org   [continuum] BUILD FAILURE: Continuum 1.3.X - Continuum :: Project - default maven2 buildDefinition Sun, 07 Mar, 07:29
Contin...@vmbuild.apache.org   [continuum] BUILD FAILURE: Continuum 1.3.X - Continuum :: Project - default maven2 buildDefinition Sun, 07 Mar, 11:02
Contin...@vmbuild.apache.org   [continuum] BUILD FAILURE: Continuum 1.3.X - Continuum :: Project - default maven2 buildDefinition Sun, 07 Mar, 14:27
Contin...@vmbuild.apache.org   [continuum] BUILD FAILURE: Continuum 1.3.X - Continuum :: Project - default maven2 buildDefinition Sun, 07 Mar, 17:25
Contin...@vmbuild.apache.org   [continuum] BUILD FAILURE: Continuum 1.3.X - Continuum :: Project - default maven2 buildDefinition Sun, 07 Mar, 19:46
Contin...@vmbuild.apache.org   [continuum] BUILD FAILURE: Continuum 1.3.X - Continuum :: Project - default maven2 buildDefinition Sun, 07 Mar, 21:26
[continuum] BUILD ERROR: Continuum 1.3.X - Continuum :: Model - default maven2 buildDefinition
Contin...@vmbuild.apache.org   [continuum] BUILD ERROR: Continuum 1.3.X - Continuum :: Model - default maven2 buildDefinition Sun, 07 Mar, 09:31
Contin...@vmbuild.apache.org   [continuum] BUILD ERROR: Continuum 1.3.X - Continuum :: Model - default maven2 buildDefinition Sun, 07 Mar, 13:02
Contin...@vmbuild.apache.org   [continuum] BUILD ERROR: Continuum 1.3.X - Continuum :: Model - default maven2 buildDefinition Sun, 07 Mar, 16:03
Contin...@vmbuild.apache.org   [continuum] BUILD ERROR: Continuum 1.3.X - Continuum :: Model - default maven2 buildDefinition Sun, 07 Mar, 18:33
Contin...@vmbuild.apache.org   [continuum] BUILD ERROR: Continuum 1.3.X - Continuum :: Model - default maven2 buildDefinition Sun, 07 Mar, 20:32
Contin...@vmbuild.apache.org   [continuum] BUILD ERROR: Continuum 1.3.X - Continuum :: Model - default maven2 buildDefinition Sun, 07 Mar, 22:16
[continuum] BUILD ERROR: Continuum 1.3.X - Continuum :: API - default maven2 buildDefinition
Contin...@vmbuild.apache.org   [continuum] BUILD ERROR: Continuum 1.3.X - Continuum :: API - default maven2 buildDefinition Sun, 07 Mar, 09:31
Contin...@vmbuild.apache.org   [continuum] BUILD ERROR: Continuum 1.3.X - Continuum :: API - default maven2 buildDefinition Sun, 07 Mar, 13:03
Contin...@vmbuild.apache.org   [continuum] BUILD ERROR: Continuum 1.3.X - Continuum :: API - default maven2 buildDefinition Sun, 07 Mar, 16:03
Contin...@vmbuild.apache.org   [continuum] BUILD ERROR: Continuum 1.3.X - Continuum :: API - default maven2 buildDefinition Sun, 07 Mar, 18:33
Contin...@vmbuild.apache.org   [continuum] BUILD ERROR: Continuum 1.3.X - Continuum :: API - default maven2 buildDefinition Sun, 07 Mar, 20:32
Contin...@vmbuild.apache.org   [continuum] BUILD ERROR: Continuum 1.3.X - Continuum :: API - default maven2 buildDefinition Sun, 07 Mar, 22:17
[continuum] BUILD ERROR: Continuum 1.3.X - Continuum :: Base - default maven2 buildDefinition
Contin...@vmbuild.apache.org   [continuum] BUILD ERROR: Continuum 1.3.X - Continuum :: Base - default maven2 buildDefinition Sun, 07 Mar, 09:32
Contin...@vmbuild.apache.org   [continuum] BUILD ERROR: Continuum 1.3.X - Continuum :: Base - default maven2 buildDefinition Sun, 07 Mar, 13:03
Contin...@vmbuild.apache.org   [continuum] BUILD ERROR: Continuum 1.3.X - Continuum :: Base - default maven2 buildDefinition Sun, 07 Mar, 16:03
Contin...@vmbuild.apache.org   [continuum] BUILD ERROR: Continuum 1.3.X - Continuum :: Base - default maven2 buildDefinition Sun, 07 Mar, 18:33
Contin...@vmbuild.apache.org   [continuum] BUILD ERROR: Continuum 1.3.X - Continuum :: Base - default maven2 buildDefinition Sun, 07 Mar, 20:33
Contin...@vmbuild.apache.org   [continuum] BUILD ERROR: Continuum 1.3.X - Continuum :: Base - default maven2 buildDefinition Sun, 07 Mar, 22:17
[continuum] BUILD ERROR: Continuum 1.3.X - Continuum :: SCM - default maven2 buildDefinition
Contin...@vmbuild.apache.org   [continuum] BUILD ERROR: Continuum 1.3.X - Continuum :: SCM - default maven2 buildDefinition Sun, 07 Mar, 09:32
Contin...@vmbuild.apache.org   [continuum] BUILD ERROR: Continuum 1.3.X - Continuum :: SCM - default maven2 buildDefinition Sun, 07 Mar, 13:03
Contin...@vmbuild.apache.org   [continuum] BUILD ERROR: Continuum 1.3.X - Continuum :: SCM - default maven2 buildDefinition Sun, 07 Mar, 16:04
Contin...@vmbuild.apache.org   [continuum] BUILD ERROR: Continuum 1.3.X - Continuum :: SCM - default maven2 buildDefinition Sun, 07 Mar, 18:33
Contin...@vmbuild.apache.org   [continuum] BUILD ERROR: Continuum 1.3.X - Continuum :: SCM - default maven2 buildDefinition Sun, 07 Mar, 20:33
Contin...@vmbuild.apache.org   [continuum] BUILD ERROR: Continuum 1.3.X - Continuum :: SCM - default maven2 buildDefinition Sun, 07 Mar, 22:17
[continuum] BUILD ERROR: Continuum 1.3.X - Continuum :: Configuration - default maven2 buildDefinition
Contin...@vmbuild.apache.org   [continuum] BUILD ERROR: Continuum 1.3.X - Continuum :: Configuration - default maven2 buildDefinition Sun, 07 Mar, 09:33
Contin...@vmbuild.apache.org   [continuum] BUILD ERROR: Continuum 1.3.X - Continuum :: Configuration - default maven2 buildDefinition Sun, 07 Mar, 13:03
Contin...@vmbuild.apache.org   [continuum] BUILD ERROR: Continuum 1.3.X - Continuum :: Configuration - default maven2 buildDefinition Sun, 07 Mar, 16:04
Contin...@vmbuild.apache.org   [continuum] BUILD ERROR: Continuum 1.3.X - Continuum :: Configuration - default maven2 buildDefinition Sun, 07 Mar, 18:33
Contin...@vmbuild.apache.org   [continuum] BUILD ERROR: Continuum 1.3.X - Continuum :: Configuration - default maven2 buildDefinition Sun, 07 Mar, 20:33
Contin...@vmbuild.apache.org   [continuum] BUILD ERROR: Continuum 1.3.X - Continuum :: Configuration - default maven2 buildDefinition Sun, 07 Mar, 22:17
[continuum] BUILD ERROR: Continuum 1.3.X - Continuum :: Test - default maven2 buildDefinition
Contin...@vmbuild.apache.org   [continuum] BUILD ERROR: Continuum 1.3.X - Continuum :: Test - default maven2 buildDefinition Sun, 07 Mar, 09:33
Contin...@vmbuild.apache.org   [continuum] BUILD ERROR: Continuum 1.3.X - Continuum :: Test - default maven2 buildDefinition Sun, 07 Mar, 13:04
Contin...@vmbuild.apache.org   [continuum] BUILD ERROR: Continuum 1.3.X - Continuum :: Test - default maven2 buildDefinition Sun, 07 Mar, 16:04
Contin...@vmbuild.apache.org   [continuum] BUILD ERROR: Continuum 1.3.X - Continuum :: Test - default maven2 buildDefinition Sun, 07 Mar, 18:34
Contin...@vmbuild.apache.org   [continuum] BUILD ERROR: Continuum 1.3.X - Continuum :: Test - default maven2 buildDefinition Sun, 07 Mar, 20:34
Contin...@vmbuild.apache.org   [continuum] BUILD ERROR: Continuum 1.3.X - Continuum :: Test - default maven2 buildDefinition Sun, 07 Mar, 22:17
[continuum] BUILD ERROR: Continuum 1.3.X - Continuum :: Store - default maven2 buildDefinition
Contin...@vmbuild.apache.org   [continuum] BUILD ERROR: Continuum 1.3.X - Continuum :: Store - default maven2 buildDefinition Sun, 07 Mar, 09:33
Contin...@vmbuild.apache.org   [continuum] BUILD ERROR: Continuum 1.3.X - Continuum :: Store - default maven2 buildDefinition Sun, 07 Mar, 13:04
Contin...@vmbuild.apache.org   [continuum] BUILD ERROR: Continuum 1.3.X - Continuum :: Store - default maven2 buildDefinition Sun, 07 Mar, 16:04
Contin...@vmbuild.apache.org   [continuum] BUILD ERROR: Continuum 1.3.X - Continuum :: Store - default maven2 buildDefinition Sun, 07 Mar, 18:34
Contin...@vmbuild.apache.org   [continuum] BUILD ERROR: Continuum 1.3.X - Continuum :: Store - default maven2 buildDefinition Sun, 07 Mar, 20:34
Contin...@vmbuild.apache.org   [continuum] BUILD ERROR: Continuum 1.3.X - Continuum :: Store - default maven2 buildDefinition Sun, 07 Mar, 22:18
[continuum] BUILD ERROR: Continuum 1.3.X - Continuum :: Commons - default maven2 buildDefinition
Contin...@vmbuild.apache.org   [continuum] BUILD ERROR: Continuum 1.3.X - Continuum :: Commons - default maven2 buildDefinition Sun, 07 Mar, 09:34
Contin...@vmbuild.apache.org   [continuum] BUILD ERROR: Continuum 1.3.X - Continuum :: Commons - default maven2 buildDefinition Sun, 07 Mar, 13:04
Contin...@vmbuild.apache.org   [continuum] BUILD ERROR: Continuum 1.3.X - Continuum :: Commons - default maven2 buildDefinition Sun, 07 Mar, 16:05
Contin...@vmbuild.apache.org   [continuum] BUILD ERROR: Continuum 1.3.X - Continuum :: Commons - default maven2 buildDefinition Sun, 07 Mar, 18:34
Contin...@vmbuild.apache.org   [continuum] BUILD ERROR: Continuum 1.3.X - Continuum :: Commons - default maven2 buildDefinition Sun, 07 Mar, 20:34
Contin...@vmbuild.apache.org   [continuum] BUILD ERROR: Continuum 1.3.X - Continuum :: Commons - default maven2 buildDefinition Sun, 07 Mar, 22:18
[continuum] BUILD ERROR: Continuum 1.3.X - Continuum :: Security - default maven2 buildDefinition
Contin...@vmbuild.apache.org   [continuum] BUILD ERROR: Continuum 1.3.X - Continuum :: Security - default maven2 buildDefinition Sun, 07 Mar, 09:34
Contin...@vmbuild.apache.org   [continuum] BUILD ERROR: Continuum 1.3.X - Continuum :: Security - default maven2 buildDefinition Sun, 07 Mar, 13:04
Contin...@vmbuild.apache.org   [continuum] BUILD ERROR: Continuum 1.3.X - Continuum :: Security - default maven2 buildDefinition Sun, 07 Mar, 16:05
Contin...@vmbuild.apache.org   [continuum] BUILD ERROR: Continuum 1.3.X - Continuum :: Security - default maven2 buildDefinition Sun, 07 Mar, 18:34
Contin...@vmbuild.apache.org   [continuum] BUILD ERROR: Continuum 1.3.X - Continuum :: Security - default maven2 buildDefinition Sun, 07 Mar, 20:35
Contin...@vmbuild.apache.org   [continuum] BUILD ERROR: Continuum 1.3.X - Continuum :: Security - default maven2 buildDefinition Sun, 07 Mar, 22:18
[continuum] BUILD ERROR: Continuum 1.3.X - Continuum :: Reports - default maven2 buildDefinition
Contin...@vmbuild.apache.org   [continuum] BUILD ERROR: Continuum 1.3.X - Continuum :: Reports - default maven2 buildDefinition Sun, 07 Mar, 09:34
Contin...@vmbuild.apache.org   [continuum] BUILD ERROR: Continuum 1.3.X - Continuum :: Reports - default maven2 buildDefinition Sun, 07 Mar, 13:05
Contin...@vmbuild.apache.org   [continuum] BUILD ERROR: Continuum 1.3.X - Continuum :: Reports - default maven2 buildDefinition Sun, 07 Mar, 16:05
Contin...@vmbuild.apache.org   [continuum] BUILD ERROR: Continuum 1.3.X - Continuum :: Reports - default maven2 buildDefinition Sun, 07 Mar, 18:35
Contin...@vmbuild.apache.org   [continuum] BUILD ERROR: Continuum 1.3.X - Continuum :: Reports - default maven2 buildDefinition Sun, 07 Mar, 20:35
Contin...@vmbuild.apache.org   [continuum] BUILD ERROR: Continuum 1.3.X - Continuum :: Reports - default maven2 buildDefinition Sun, 07 Mar, 22:18
[continuum] BUILD ERROR: Continuum 1.3.X - Continuum :: Notifiers - default maven2 buildDefinition
Contin...@vmbuild.apache.org   [continuum] BUILD ERROR: Continuum 1.3.X - Continuum :: Notifiers - default maven2 buildDefinition Sun, 07 Mar, 09:34
Contin...@vmbuild.apache.org   [continuum] BUILD ERROR: Continuum 1.3.X - Continuum :: Notifiers - default maven2 buildDefinition Sun, 07 Mar, 13:05
Contin...@vmbuild.apache.org   [continuum] BUILD ERROR: Continuum 1.3.X - Continuum :: Notifiers - default maven2 buildDefinition Sun, 07 Mar, 16:06
Contin...@vmbuild.apache.org   [continuum] BUILD ERROR: Continuum 1.3.X - Continuum :: Notifiers - default maven2 buildDefinition Sun, 07 Mar, 18:35
Contin...@vmbuild.apache.org   [continuum] BUILD ERROR: Continuum 1.3.X - Continuum :: Notifiers - default maven2 buildDefinition Sun, 07 Mar, 20:35
Contin...@vmbuild.apache.org   [continuum] BUILD ERROR: Continuum 1.3.X - Continuum :: Notifiers - default maven2 buildDefinition Sun, 07 Mar, 22:19
[continuum] BUILD ERROR: Continuum 1.3.X - Continuum :: Notifier API - default maven2 buildDefinition
Contin...@vmbuild.apache.org   [continuum] BUILD ERROR: Continuum 1.3.X - Continuum :: Notifier API - default maven2 buildDefinition Sun, 07 Mar, 09:35
Contin...@vmbuild.apache.org   [continuum] BUILD ERROR: Continuum 1.3.X - Continuum :: Notifier API - default maven2 buildDefinition Sun, 07 Mar, 13:05
Contin...@vmbuild.apache.org   [continuum] BUILD ERROR: Continuum 1.3.X - Continuum :: Notifier API - default maven2 buildDefinition Sun, 07 Mar, 16:06
Contin...@vmbuild.apache.org   [continuum] BUILD ERROR: Continuum 1.3.X - Continuum :: Notifier API - default maven2 buildDefinition Sun, 07 Mar, 18:35
Contin...@vmbuild.apache.org   [continuum] BUILD ERROR: Continuum 1.3.X - Continuum :: Notifier API - default maven2 buildDefinition Sun, 07 Mar, 20:36
Contin...@vmbuild.apache.org   [continuum] BUILD ERROR: Continuum 1.3.X - Continuum :: Notifier API - default maven2 buildDefinition Sun, 07 Mar, 22:19
[continuum] BUILD ERROR: Continuum 1.3.X - Continuum :: Release System - default maven2 buildDefinition
Contin...@vmbuild.apache.org   [continuum] BUILD ERROR: Continuum 1.3.X - Continuum :: Release System - default maven2 buildDefinition Sun, 07 Mar, 09:35
Contin...@vmbuild.apache.org   [continuum] BUILD ERROR: Continuum 1.3.X - Continuum :: Release System - default maven2 buildDefinition Sun, 07 Mar, 13:06
Contin...@vmbuild.apache.org   [continuum] BUILD ERROR: Continuum 1.3.X - Continuum :: Release System - default maven2 buildDefinition Sun, 07 Mar, 16:07
Contin...@vmbuild.apache.org   [continuum] BUILD ERROR: Continuum 1.3.X - Continuum :: Release System - default maven2 buildDefinition Sun, 07 Mar, 18:35
Contin...@vmbuild.apache.org   [continuum] BUILD ERROR: Continuum 1.3.X - Continuum :: Release System - default maven2 buildDefinition Sun, 07 Mar, 20:37
Contin...@vmbuild.apache.org   [continuum] BUILD ERROR: Continuum 1.3.X - Continuum :: Release System - default maven2 buildDefinition Sun, 07 Mar, 22:19
[continuum] BUILD ERROR: Continuum 1.3.X - Continuum :: Purge System - default maven2 buildDefinition
Contin...@vmbuild.apache.org   [continuum] BUILD ERROR: Continuum 1.3.X - Continuum :: Purge System - default maven2 buildDefinition Sun, 07 Mar, 09:36
Contin...@vmbuild.apache.org   [continuum] BUILD ERROR: Continuum 1.3.X - Continuum :: Purge System - default maven2 buildDefinition Sun, 07 Mar, 13:06
Contin...@vmbuild.apache.org   [continuum] BUILD ERROR: Continuum 1.3.X - Continuum :: Purge System - default maven2 buildDefinition Sun, 07 Mar, 16:07
Contin...@vmbuild.apache.org   [continuum] BUILD ERROR: Continuum 1.3.X - Continuum :: Purge System - default maven2 buildDefinition Sun, 07 Mar, 18:36
Contin...@vmbuild.apache.org   [continuum] BUILD ERROR: Continuum 1.3.X - Continuum :: Purge System - default maven2 buildDefinition Sun, 07 Mar, 20:37
Contin...@vmbuild.apache.org   [continuum] BUILD ERROR: Continuum 1.3.X - Continuum :: Purge System - default maven2 buildDefinition Sun, 07 Mar, 22:19
[continuum] BUILD ERROR: Continuum 1.3.X - Continuum :: Distributed Build :: Transport - default maven2 buildDefinition
Contin...@vmbuild.apache.org   [continuum] BUILD ERROR: Continuum 1.3.X - Continuum :: Distributed Build :: Transport - default maven2 buildDefinition Sun, 07 Mar, 09:36
Contin...@vmbuild.apache.org   [continuum] BUILD ERROR: Continuum 1.3.X - Continuum :: Distributed Build :: Transport - default maven2 buildDefinition Sun, 07 Mar, 13:06
Contin...@vmbuild.apache.org   [continuum] BUILD ERROR: Continuum 1.3.X - Continuum :: Distributed Build :: Transport - default maven2 buildDefinition Sun, 07 Mar, 16:07
Contin...@vmbuild.apache.org   [continuum] BUILD ERROR: Continuum 1.3.X - Continuum :: Distributed Build :: Transport - default maven2 buildDefinition Sun, 07 Mar, 18:36
Contin...@vmbuild.apache.org   [continuum] BUILD ERROR: Continuum 1.3.X - Continuum :: Distributed Build :: Transport - default maven2 buildDefinition Sun, 07 Mar, 20:37
Contin...@vmbuild.apache.org   [continuum] BUILD ERROR: Continuum 1.3.X - Continuum :: Distributed Build :: Transport - default maven2 buildDefinition Sun, 07 Mar, 22:20
[continuum] BUILD ERROR: Continuum 1.3.X - Continuum :: Distributed Build :: Transport :: Slave - default maven2 buildDefinition
Contin...@vmbuild.apache.org   [continuum] BUILD ERROR: Continuum 1.3.X - Continuum :: Distributed Build :: Transport :: Slave - default maven2 buildDefinition Sun, 07 Mar, 09:36
Contin...@vmbuild.apache.org   [continuum] BUILD ERROR: Continuum 1.3.X - Continuum :: Distributed Build :: Transport :: Slave - default maven2 buildDefinition Sun, 07 Mar, 13:06
Contin...@vmbuild.apache.org   [continuum] BUILD ERROR: Continuum 1.3.X - Continuum :: Distributed Build :: Transport :: Slave - default maven2 buildDefinition Sun, 07 Mar, 16:08
Contin...@vmbuild.apache.org   [continuum] BUILD ERROR: Continuum 1.3.X - Continuum :: Distributed Build :: Transport :: Slave - default maven2 buildDefinition Sun, 07 Mar, 18:36
Contin...@vmbuild.apache.org   [continuum] BUILD ERROR: Continuum 1.3.X - Continuum :: Distributed Build :: Transport :: Slave - default maven2 buildDefinition Sun, 07 Mar, 20:37
Contin...@vmbuild.apache.org   [continuum] BUILD ERROR: Continuum 1.3.X - Continuum :: Distributed Build :: Transport :: Slave - default maven2 buildDefinition Sun, 07 Mar, 22:20
[continuum] BUILD ERROR: Continuum 1.3.X - Continuum :: Distributed Build :: Transport :: Slave :: API - default maven2 buildDefinition
Contin...@vmbuild.apache.org   [continuum] BUILD ERROR: Continuum 1.3.X - Continuum :: Distributed Build :: Transport :: Slave :: API - default maven2 buildDefinition Sun, 07 Mar, 09:36
Contin...@vmbuild.apache.org   [continuum] BUILD ERROR: Continuum 1.3.X - Continuum :: Distributed Build :: Transport :: Slave :: API - default maven2 buildDefinition Sun, 07 Mar, 13:07
Contin...@vmbuild.apache.org   [continuum] BUILD ERROR: Continuum 1.3.X - Continuum :: Distributed Build :: Transport :: Slave :: API - default maven2 buildDefinition Sun, 07 Mar, 16:08
Contin...@vmbuild.apache.org   [continuum] BUILD ERROR: Continuum 1.3.X - Continuum :: Distributed Build :: Transport :: Slave :: API - default maven2 buildDefinition Sun, 07 Mar, 18:37
Contin...@vmbuild.apache.org   [continuum] BUILD ERROR: Continuum 1.3.X - Continuum :: Distributed Build :: Transport :: Slave :: API - default maven2 buildDefinition Sun, 07 Mar, 20:38
Contin...@vmbuild.apache.org   [continuum] BUILD ERROR: Continuum 1.3.X - Continuum :: Distributed Build :: Transport :: Slave :: API - default maven2 buildDefinition Sun, 07 Mar, 22:20
[continuum] BUILD ERROR: Continuum 1.3.X - Continuum :: Builder - default maven2 buildDefinition
Contin...@vmbuild.apache.org   [continuum] BUILD ERROR: Continuum 1.3.X - Continuum :: Builder - default maven2 buildDefinition Sun, 07 Mar, 09:37
Contin...@vmbuild.apache.org   [continuum] BUILD ERROR: Continuum 1.3.X - Continuum :: Builder - default maven2 buildDefinition Sun, 07 Mar, 13:07
Contin...@vmbuild.apache.org   [continuum] BUILD ERROR: Continuum 1.3.X - Continuum :: Builder - default maven2 buildDefinition Sun, 07 Mar, 16:08
Contin...@vmbuild.apache.org   [continuum] BUILD ERROR: Continuum 1.3.X - Continuum :: Builder - default maven2 buildDefinition Sun, 07 Mar, 18:37
Contin...@vmbuild.apache.org   [continuum] BUILD ERROR: Continuum 1.3.X - Continuum :: Builder - default maven2 buildDefinition Sun, 07 Mar, 20:38
Contin...@vmbuild.apache.org   [continuum] BUILD ERROR: Continuum 1.3.X - Continuum :: Builder - default maven2 buildDefinition Sun, 07 Mar, 22:20
[continuum] BUILD ERROR: Continuum 1.3.X - Continuum :: Core - default maven2 buildDefinition
Contin...@vmbuild.apache.org   [continuum] BUILD ERROR: Continuum 1.3.X - Continuum :: Core - default maven2 buildDefinition Sun, 07 Mar, 09:37
Contin...@vmbuild.apache.org   [continuum] BUILD ERROR: Continuum 1.3.X - Continuum :: Core - default maven2 buildDefinition Sun, 07 Mar, 13:07
Contin...@vmbuild.apache.org   [continuum] BUILD ERROR: Continuum 1.3.X - Continuum :: Core - default maven2 buildDefinition Sun, 07 Mar, 16:09
Contin...@vmbuild.apache.org   [continuum] BUILD ERROR: Continuum 1.3.X - Continuum :: Core - default maven2 buildDefinition Sun, 07 Mar, 18:37
Contin...@vmbuild.apache.org   [continuum] BUILD ERROR: Continuum 1.3.X - Continuum :: Core - default maven2 buildDefinition Sun, 07 Mar, 20:39
Contin...@vmbuild.apache.org   [continuum] BUILD ERROR: Continuum 1.3.X - Continuum :: Core - default maven2 buildDefinition Sun, 07 Mar, 22:21
[continuum] BUILD ERROR: Continuum 1.3.X - Continuum :: IRC Notifier - default maven2 buildDefinition
Contin...@vmbuild.apache.org   [continuum] BUILD ERROR: Continuum 1.3.X - Continuum :: IRC Notifier - default maven2 buildDefinition Sun, 07 Mar, 09:43
Contin...@vmbuild.apache.org   [continuum] BUILD ERROR: Continuum 1.3.X - Continuum :: IRC Notifier - default maven2 buildDefinition Sun, 07 Mar, 13:08
Contin...@vmbuild.apache.org   [continuum] BUILD ERROR: Continuum 1.3.X - Continuum :: IRC Notifier - default maven2 buildDefinition Sun, 07 Mar, 16:09
Contin...@vmbuild.apache.org   [continuum] BUILD ERROR: Continuum 1.3.X - Continuum :: IRC Notifier - default maven2 buildDefinition Sun, 07 Mar, 18:38
Contin...@vmbuild.apache.org   [continuum] BUILD ERROR: Continuum 1.3.X - Continuum :: IRC Notifier - default maven2 buildDefinition Sun, 07 Mar, 20:39
Contin...@vmbuild.apache.org   [continuum] BUILD ERROR: Continuum 1.3.X - Continuum :: IRC Notifier - default maven2 buildDefinition Sun, 07 Mar, 22:21
[continuum] BUILD ERROR: Continuum 1.3.X - Continuum :: Jabber Notifier - default maven2 buildDefinition
Contin...@vmbuild.apache.org   [continuum] BUILD ERROR: Continuum 1.3.X - Continuum :: Jabber Notifier - default maven2 buildDefinition Sun, 07 Mar, 09:44
Contin...@vmbuild.apache.org   [continuum] BUILD ERROR: Continuum 1.3.X - Continuum :: Jabber Notifier - default maven2 buildDefinition Sun, 07 Mar, 13:08
Contin...@vmbuild.apache.org   [continuum] BUILD ERROR: Continuum 1.3.X - Continuum :: Jabber Notifier - default maven2 buildDefinition Sun, 07 Mar, 16:09
Contin...@vmbuild.apache.org   [continuum] BUILD ERROR: Continuum 1.3.X - Continuum :: Jabber Notifier - default maven2 buildDefinition Sun, 07 Mar, 18:38
Contin...@vmbuild.apache.org   [continuum] BUILD ERROR: Continuum 1.3.X - Continuum :: Jabber Notifier - default maven2 buildDefinition Sun, 07 Mar, 20:40
Contin...@vmbuild.apache.org   [continuum] BUILD ERROR: Continuum 1.3.X - Continuum :: Jabber Notifier - default maven2 buildDefinition Sun, 07 Mar, 22:21
[continuum] BUILD ERROR: Continuum 1.3.X - Continuum :: MSN Notifier - default maven2 buildDefinition
Contin...@vmbuild.apache.org   [continuum] BUILD ERROR: Continuum 1.3.X - Continuum :: MSN Notifier - default maven2 buildDefinition Sun, 07 Mar, 09:44
Contin...@vmbuild.apache.org   [continuum] BUILD ERROR: Continuum 1.3.X - Continuum :: MSN Notifier - default maven2 buildDefinition Sun, 07 Mar, 13:08
Contin...@vmbuild.apache.org   [continuum] BUILD ERROR: Continuum 1.3.X - Continuum :: MSN Notifier - default maven2 buildDefinition Sun, 07 Mar, 16:11
Contin...@vmbuild.apache.org   [continuum] BUILD ERROR: Continuum 1.3.X - Continuum :: MSN Notifier - default maven2 buildDefinition Sun, 07 Mar, 18:38
Contin...@vmbuild.apache.org   [continuum] BUILD ERROR: Continuum 1.3.X - Continuum :: MSN Notifier - default maven2 buildDefinition Sun, 07 Mar, 20:40
Contin...@vmbuild.apache.org   [continuum] BUILD ERROR: Continuum 1.3.X - Continuum :: MSN Notifier - default maven2 buildDefinition Sun, 07 Mar, 22:21
[continuum] BUILD ERROR: Continuum 1.3.X - Continuum :: Wagon Notifier - default maven2 buildDefinition
Contin...@vmbuild.apache.org   [continuum] BUILD ERROR: Continuum 1.3.X - Continuum :: Wagon Notifier - default maven2 buildDefinition Sun, 07 Mar, 09:45
Contin...@vmbuild.apache.org   [continuum] BUILD ERROR: Continuum 1.3.X - Continuum :: Wagon Notifier - default maven2 buildDefinition Sun, 07 Mar, 13:08
Contin...@vmbuild.apache.org   [continuum] BUILD ERROR: Continuum 1.3.X - Continuum :: Wagon Notifier - default maven2 buildDefinition Sun, 07 Mar, 16:11
Contin...@vmbuild.apache.org   [continuum] BUILD ERROR: Continuum 1.3.X - Continuum :: Wagon Notifier - default maven2 buildDefinition Sun, 07 Mar, 18:38
Contin...@vmbuild.apache.org   [continuum] BUILD ERROR: Continuum 1.3.X - Continuum :: Wagon Notifier - default maven2 buildDefinition Sun, 07 Mar, 20:40
Contin...@vmbuild.apache.org   [continuum] BUILD ERROR: Continuum 1.3.X - Continuum :: Wagon Notifier - default maven2 buildDefinition Sun, 07 Mar, 22:22
[continuum] BUILD ERROR: Continuum 1.3.X - Continuum :: XMLRPC :: Parent - default maven2 buildDefinition
Contin...@vmbuild.apache.org   [continuum] BUILD ERROR: Continuum 1.3.X - Continuum :: XMLRPC :: Parent - default maven2 buildDefinition Sun, 07 Mar, 09:45
Contin...@vmbuild.apache.org   [continuum] BUILD ERROR: Continuum 1.3.X - Continuum :: XMLRPC :: Parent - default maven2 buildDefinition Sun, 07 Mar, 13:09
Contin...@vmbuild.apache.org   [continuum] BUILD ERROR: Continuum 1.3.X - Continuum :: XMLRPC :: Parent - default maven2 buildDefinition Sun, 07 Mar, 16:11
Contin...@vmbuild.apache.org   [continuum] BUILD ERROR: Continuum 1.3.X - Continuum :: XMLRPC :: Parent - default maven2 buildDefinition Sun, 07 Mar, 18:39
Contin...@vmbuild.apache.org   [continuum] BUILD ERROR: Continuum 1.3.X - Continuum :: XMLRPC :: Parent - default maven2 buildDefinition Sun, 07 Mar, 20:41
Contin...@vmbuild.apache.org   [continuum] BUILD ERROR: Continuum 1.3.X - Continuum :: XMLRPC :: Parent - default maven2 buildDefinition Sun, 07 Mar, 22:22
[continuum] BUILD ERROR: Continuum 1.3.X - Continuum :: XMLRPC :: API - default maven2 buildDefinition
Contin...@vmbuild.apache.org   [continuum] BUILD ERROR: Continuum 1.3.X - Continuum :: XMLRPC :: API - default maven2 buildDefinition Sun, 07 Mar, 09:45
Contin...@vmbuild.apache.org   [continuum] BUILD ERROR: Continuum 1.3.X - Continuum :: XMLRPC :: API - default maven2 buildDefinition Sun, 07 Mar, 13:09
Contin...@vmbuild.apache.org   [continuum] BUILD ERROR: Continuum 1.3.X - Continuum :: XMLRPC :: API - default maven2 buildDefinition Sun, 07 Mar, 16:12
Contin...@vmbuild.apache.org   [continuum] BUILD ERROR: Continuum 1.3.X - Continuum :: XMLRPC :: API - default maven2 buildDefinition Sun, 07 Mar, 18:39
Contin...@vmbuild.apache.org   [continuum] BUILD ERROR: Continuum 1.3.X - Continuum :: XMLRPC :: API - default maven2 buildDefinition Sun, 07 Mar, 20:41
Contin...@vmbuild.apache.org   [continuum] BUILD ERROR: Continuum 1.3.X - Continuum :: XMLRPC :: API - default maven2 buildDefinition Sun, 07 Mar, 22:22
[continuum] BUILD ERROR: Continuum 1.3.X - Continuum :: XMLRPC :: Server - default maven2 buildDefinition
Contin...@vmbuild.apache.org   [continuum] BUILD ERROR: Continuum 1.3.X - Continuum :: XMLRPC :: Server - default maven2 buildDefinition Sun, 07 Mar, 09:46
Contin...@vmbuild.apache.org   [continuum] BUILD ERROR: Continuum 1.3.X - Continuum :: XMLRPC :: Server - default maven2 buildDefinition Sun, 07 Mar, 13:09
Contin...@vmbuild.apache.org   [continuum] BUILD ERROR: Continuum 1.3.X - Continuum :: XMLRPC :: Server - default maven2 buildDefinition Sun, 07 Mar, 16:12
Contin...@vmbuild.apache.org   [continuum] BUILD ERROR: Continuum 1.3.X - Continuum :: XMLRPC :: Server - default maven2 buildDefinition Sun, 07 Mar, 18:40
Contin...@vmbuild.apache.org   [continuum] BUILD ERROR: Continuum 1.3.X - Continuum :: XMLRPC :: Server - default maven2 buildDefinition Sun, 07 Mar, 20:41
Contin...@vmbuild.apache.org   [continuum] BUILD ERROR: Continuum 1.3.X - Continuum :: XMLRPC :: Server - default maven2 buildDefinition Sun, 07 Mar, 22:22
[continuum] BUILD ERROR: Continuum 1.3.X - Continuum :: Distributed Build :: Transport :: Master - default maven2 buildDefinition
Contin...@vmbuild.apache.org   [continuum] BUILD ERROR: Continuum 1.3.X - Continuum :: Distributed Build :: Transport :: Master - default maven2 buildDefinition Sun, 07 Mar, 09:46
Contin...@vmbuild.apache.org   [continuum] BUILD ERROR: Continuum 1.3.X - Continuum :: Distributed Build :: Transport :: Master - default maven2 buildDefinition Sun, 07 Mar, 13:09
Contin...@vmbuild.apache.org   [continuum] BUILD ERROR: Continuum 1.3.X - Continuum :: Distributed Build :: Transport :: Master - default maven2 buildDefinition Sun, 07 Mar, 16:12
Contin...@vmbuild.apache.org   [continuum] BUILD ERROR: Continuum 1.3.X - Continuum :: Distributed Build :: Transport :: Master - default maven2 buildDefinition Sun, 07 Mar, 18:40
Contin...@vmbuild.apache.org   [continuum] BUILD ERROR: Continuum 1.3.X - Continuum :: Distributed Build :: Transport :: Master - default maven2 buildDefinition Sun, 07 Mar, 20:42
Contin...@vmbuild.apache.org   [continuum] BUILD ERROR: Continuum 1.3.X - Continuum :: Distributed Build :: Transport :: Master - default maven2 buildDefinition Sun, 07 Mar, 22:22
[continuum] BUILD ERROR: Continuum 1.3.X - Continuum :: Distributed Build :: Transport :: Master :: API - default maven2 buildDefinition
Contin...@vmbuild.apache.org   [continuum] BUILD ERROR: Continuum 1.3.X - Continuum :: Distributed Build :: Transport :: Master :: API - default maven2 buildDefinition Sun, 07 Mar, 09:46
Contin...@vmbuild.apache.org   [continuum] BUILD ERROR: Continuum 1.3.X - Continuum :: Distributed Build :: Transport :: Master :: API - default maven2 buildDefinition Sun, 07 Mar, 13:10
Contin...@vmbuild.apache.org   [continuum] BUILD ERROR: Continuum 1.3.X - Continuum :: Distributed Build :: Transport :: Master :: API - default maven2 buildDefinition Sun, 07 Mar, 16:13
Contin...@vmbuild.apache.org   [continuum] BUILD ERROR: Continuum 1.3.X - Continuum :: Distributed Build :: Transport :: Master :: API - default maven2 buildDefinition Sun, 07 Mar, 18:40
Contin...@vmbuild.apache.org   [continuum] BUILD ERROR: Continuum 1.3.X - Continuum :: Distributed Build :: Transport :: Master :: API - default maven2 buildDefinition Sun, 07 Mar, 20:42
Contin...@vmbuild.apache.org   [continuum] BUILD ERROR: Continuum 1.3.X - Continuum :: Distributed Build :: Transport :: Master :: API - default maven2 buildDefinition Sun, 07 Mar, 22:23
[continuum] BUILD ERROR: Continuum 1.3.X - Continuum :: Distributed Build :: Transport :: Master :: Server - default maven2 buildDefinition
Contin...@vmbuild.apache.org   [continuum] BUILD ERROR: Continuum 1.3.X - Continuum :: Distributed Build :: Transport :: Master :: Server - default maven2 buildDefinition Sun, 07 Mar, 09:47
Contin...@vmbuild.apache.org   [continuum] BUILD ERROR: Continuum 1.3.X - Continuum :: Distributed Build :: Transport :: Master :: Server - default maven2 buildDefinition Sun, 07 Mar, 13:10
Contin...@vmbuild.apache.org   [continuum] BUILD ERROR: Continuum 1.3.X - Continuum :: Distributed Build :: Transport :: Master :: Server - default maven2 buildDefinition Sun, 07 Mar, 16:13
Contin...@vmbuild.apache.org   [continuum] BUILD ERROR: Continuum 1.3.X - Continuum :: Distributed Build :: Transport :: Master :: Server - default maven2 buildDefinition Sun, 07 Mar, 18:41
Contin...@vmbuild.apache.org   [continuum] BUILD ERROR: Continuum 1.3.X - Continuum :: Distributed Build :: Transport :: Master :: Server - default maven2 buildDefinition Sun, 07 Mar, 20:42
Contin...@vmbuild.apache.org   [continuum] BUILD ERROR: Continuum 1.3.X - Continuum :: Distributed Build :: Transport :: Master :: Server - default maven2 buildDefinition Sun, 07 Mar, 22:23
[continuum] BUILD ERROR: Continuum 1.3.X - Continuum :: Web APP - default maven2 buildDefinition
Contin...@vmbuild.apache.org   [continuum] BUILD ERROR: Continuum 1.3.X - Continuum :: Web APP - default maven2 buildDefinition Sun, 07 Mar, 09:47
Contin...@vmbuild.apache.org   [continuum] BUILD ERROR: Continuum 1.3.X - Continuum :: Web APP - default maven2 buildDefinition Sun, 07 Mar, 13:10
Contin...@vmbuild.apache.org   [continuum] BUILD ERROR: Continuum 1.3.X - Continuum :: Web APP - default maven2 buildDefinition Sun, 07 Mar, 16:13
Contin...@vmbuild.apache.org   [continuum] BUILD ERROR: Continuum 1.3.X - Continuum :: Web APP - default maven2 buildDefinition Sun, 07 Mar, 18:42
Contin...@vmbuild.apache.org   [continuum] BUILD ERROR: Continuum 1.3.X - Continuum :: Web APP - default maven2 buildDefinition Sun, 07 Mar, 20:43
Contin...@vmbuild.apache.org   [continuum] BUILD ERROR: Continuum 1.3.X - Continuum :: Web APP - default maven2 buildDefinition Sun, 07 Mar, 22:23
[continuum] BUILD ERROR: Continuum 1.3.X - Continuum :: XMLRPC :: Client - default maven2 buildDefinition
Contin...@vmbuild.apache.org   [continuum] BUILD ERROR: Continuum 1.3.X - Continuum :: XMLRPC :: Client - default maven2 buildDefinition Sun, 07 Mar, 09:47
Contin...@vmbuild.apache.org   [continuum] BUILD ERROR: Continuum 1.3.X - Continuum :: XMLRPC :: Client - default maven2 buildDefinition Sun, 07 Mar, 13:10
Contin...@vmbuild.apache.org   [continuum] BUILD ERROR: Continuum 1.3.X - Continuum :: XMLRPC :: Client - default maven2 buildDefinition Sun, 07 Mar, 16:13
Contin...@vmbuild.apache.org   [continuum] BUILD ERROR: Continuum 1.3.X - Continuum :: XMLRPC :: Client - default maven2 buildDefinition Sun, 07 Mar, 18:42
Contin...@vmbuild.apache.org   [continuum] BUILD ERROR: Continuum 1.3.X - Continuum :: XMLRPC :: Client - default maven2 buildDefinition Sun, 07 Mar, 20:43
Contin...@vmbuild.apache.org   [continuum] BUILD ERROR: Continuum 1.3.X - Continuum :: XMLRPC :: Client - default maven2 buildDefinition Sun, 07 Mar, 22:23
[continuum] BUILD ERROR: Continuum 1.3.X - Continuum :: XMLRPC :: Backup Tool - default maven2 buildDefinition
Contin...@vmbuild.apache.org   [continuum] BUILD ERROR: Continuum 1.3.X - Continuum :: XMLRPC :: Backup Tool - default maven2 buildDefinition Sun, 07 Mar, 09:47
Contin...@vmbuild.apache.org   [continuum] BUILD ERROR: Continuum 1.3.X - Continuum :: XMLRPC :: Backup Tool - default maven2 buildDefinition Sun, 07 Mar, 13:11
Contin...@vmbuild.apache.org   [continuum] BUILD ERROR: Continuum 1.3.X - Continuum :: XMLRPC :: Backup Tool - default maven2 buildDefinition Sun, 07 Mar, 16:14
Contin...@vmbuild.apache.org   [continuum] BUILD ERROR: Continuum 1.3.X - Continuum :: XMLRPC :: Backup Tool - default maven2 buildDefinition Sun, 07 Mar, 18:42
Contin...@vmbuild.apache.org   [continuum] BUILD ERROR: Continuum 1.3.X - Continuum :: XMLRPC :: Backup Tool - default maven2 buildDefinition Sun, 07 Mar, 20:43
Contin...@vmbuild.apache.org   [continuum] BUILD ERROR: Continuum 1.3.X - Continuum :: XMLRPC :: Backup Tool - default maven2 buildDefinition Sun, 07 Mar, 22:24
[continuum] BUILD ERROR: Continuum 1.3.X - Continuum :: Data Management :: Parent - default maven2 buildDefinition
Contin...@vmbuild.apache.org   [continuum] BUILD ERROR: Continuum 1.3.X - Continuum :: Data Management :: Parent - default maven2 buildDefinition Sun, 07 Mar, 09:47
Contin...@vmbuild.apache.org   [continuum] BUILD ERROR: Continuum 1.3.X - Continuum :: Data Management :: Parent - default maven2 buildDefinition Sun, 07 Mar, 13:11
Contin...@vmbuild.apache.org   [continuum] BUILD ERROR: Continuum 1.3.X - Continuum :: Data Management :: Parent - default maven2 buildDefinition Sun, 07 Mar, 16:14
Contin...@vmbuild.apache.org   [continuum] BUILD ERROR: Continuum 1.3.X - Continuum :: Data Management :: Parent - default maven2 buildDefinition Sun, 07 Mar, 18:42
Contin...@vmbuild.apache.org   [continuum] BUILD ERROR: Continuum 1.3.X - Continuum :: Data Management :: Parent - default maven2 buildDefinition Sun, 07 Mar, 20:44
Contin...@vmbuild.apache.org   [continuum] BUILD ERROR: Continuum 1.3.X - Continuum :: Data Management :: Parent - default maven2 buildDefinition Sun, 07 Mar, 22:24
[continuum] BUILD ERROR: Continuum 1.3.X - Continuum :: Data Management :: API - default maven2 buildDefinition
Contin...@vmbuild.apache.org   [continuum] BUILD ERROR: Continuum 1.3.X - Continuum :: Data Management :: API - default maven2 buildDefinition Sun, 07 Mar, 09:48
Contin...@vmbuild.apache.org   [continuum] BUILD ERROR: Continuum 1.3.X - Continuum :: Data Management :: API - default maven2 buildDefinition Sun, 07 Mar, 13:11
Contin...@vmbuild.apache.org   [continuum] BUILD ERROR: Continuum 1.3.X - Continuum :: Data Management :: API - default maven2 buildDefinition Sun, 07 Mar, 16:14
Contin...@vmbuild.apache.org   [continuum] BUILD ERROR: Continuum 1.3.X - Continuum :: Data Management :: API - default maven2 buildDefinition Sun, 07 Mar, 18:43
Contin...@vmbuild.apache.org   [continuum] BUILD ERROR: Continuum 1.3.X - Continuum :: Data Management :: API - default maven2 buildDefinition Sun, 07 Mar, 20:44
Contin...@vmbuild.apache.org   [continuum] BUILD ERROR: Continuum 1.3.X - Continuum :: Data Management :: API - default maven2 buildDefinition Sun, 07 Mar, 22:24
[continuum] BUILD ERROR: Continuum 1.3.X - Continuum :: Legacy Model - default maven2 buildDefinition
Contin...@vmbuild.apache.org   [continuum] BUILD ERROR: Continuum 1.3.X - Continuum :: Legacy Model - default maven2 buildDefinition Sun, 07 Mar, 09:48
Contin...@vmbuild.apache.org   [continuum] BUILD ERROR: Continuum 1.3.X - Continuum :: Legacy Model - default maven2 buildDefinition Sun, 07 Mar, 13:11
Contin...@vmbuild.apache.org   [continuum] BUILD ERROR: Continuum 1.3.X - Continuum :: Legacy Model - default maven2 buildDefinition Sun, 07 Mar, 16:15
Contin...@vmbuild.apache.org   [continuum] BUILD ERROR: Continuum 1.3.X - Continuum :: Legacy Model - default maven2 buildDefinition Sun, 07 Mar, 18:43
Contin...@vmbuild.apache.org   [continuum] BUILD ERROR: Continuum 1.3.X - Continuum :: Legacy Model - default maven2 buildDefinition Sun, 07 Mar, 20:44
Contin...@vmbuild.apache.org   [continuum] BUILD ERROR: Continuum 1.3.X - Continuum :: Legacy Model - default maven2 buildDefinition Sun, 07 Mar, 22:24
[continuum] BUILD ERROR: Continuum 1.3.X - Continuum :: Data Management :: JDO - default maven2 buildDefinition
Contin...@vmbuild.apache.org   [continuum] BUILD ERROR: Continuum 1.3.X - Continuum :: Data Management :: JDO - default maven2 buildDefinition Sun, 07 Mar, 09:48
Contin...@vmbuild.apache.org   [continuum] BUILD ERROR: Continuum 1.3.X - Continuum :: Data Management :: JDO - default maven2 buildDefinition Sun, 07 Mar, 13:12
Contin...@vmbuild.apache.org   [continuum] BUILD ERROR: Continuum 1.3.X - Continuum :: Data Management :: JDO - default maven2 buildDefinition Sun, 07 Mar, 16:16
Contin...@vmbuild.apache.org   [continuum] BUILD ERROR: Continuum 1.3.X - Continuum :: Data Management :: JDO - default maven2 buildDefinition Sun, 07 Mar, 18:43
Contin...@vmbuild.apache.org   [continuum] BUILD ERROR: Continuum 1.3.X - Continuum :: Data Management :: JDO - default maven2 buildDefinition Sun, 07 Mar, 20:45
Contin...@vmbuild.apache.org   [continuum] BUILD ERROR: Continuum 1.3.X - Continuum :: Data Management :: JDO - default maven2 buildDefinition Sun, 07 Mar, 22:25
[continuum] BUILD ERROR: Continuum 1.3.X - Continuum :: Redback :: Legacy Model - default maven2 buildDefinition
Contin...@vmbuild.apache.org   [continuum] BUILD ERROR: Continuum 1.3.X - Continuum :: Redback :: Legacy Model - default maven2 buildDefinition Sun, 07 Mar, 09:49
Contin...@vmbuild.apache.org   [continuum] BUILD ERROR: Continuum 1.3.X - Continuum :: Redback :: Legacy Model - default maven2 buildDefinition Sun, 07 Mar, 13:12
Contin...@vmbuild.apache.org   [continuum] BUILD ERROR: Continuum 1.3.X - Continuum :: Redback :: Legacy Model - default maven2 buildDefinition Sun, 07 Mar, 16:16
Contin...@vmbuild.apache.org   [continuum] BUILD ERROR: Continuum 1.3.X - Continuum :: Redback :: Legacy Model - default maven2 buildDefinition Sun, 07 Mar, 18:44
Contin...@vmbuild.apache.org   [continuum] BUILD ERROR: Continuum 1.3.X - Continuum :: Redback :: Legacy Model - default maven2 buildDefinition Sun, 07 Mar, 20:45
Contin...@vmbuild.apache.org   [continuum] BUILD ERROR: Continuum 1.3.X - Continuum :: Redback :: Legacy Model - default maven2 buildDefinition Sun, 07 Mar, 22:25
[continuum] BUILD ERROR: Continuum 1.3.X - Continuum :: Data Management :: Redback JDO - default maven2 buildDefinition
Contin...@vmbuild.apache.org   [continuum] BUILD ERROR: Continuum 1.3.X - Continuum :: Data Management :: Redback JDO - default maven2 buildDefinition Sun, 07 Mar, 09:49
Contin...@vmbuild.apache.org   [continuum] BUILD ERROR: Continuum 1.3.X - Continuum :: Data Management :: Redback JDO - default maven2 buildDefinition Sun, 07 Mar, 13:12
Contin...@vmbuild.apache.org   [continuum] BUILD ERROR: Continuum 1.3.X - Continuum :: Data Management :: Redback JDO - default maven2 buildDefinition Sun, 07 Mar, 16:17
Contin...@vmbuild.apache.org   [continuum] BUILD ERROR: Continuum 1.3.X - Continuum :: Data Management :: Redback JDO - default maven2 buildDefinition Sun, 07 Mar, 18:44
Contin...@vmbuild.apache.org   [continuum] BUILD ERROR: Continuum 1.3.X - Continuum :: Data Management :: Redback JDO - default maven2 buildDefinition Sun, 07 Mar, 20:45
Contin...@vmbuild.apache.org   [continuum] BUILD ERROR: Continuum 1.3.X - Continuum :: Data Management :: Redback JDO - default maven2 buildDefinition Sun, 07 Mar, 22:25
Message list1 · 2 · 3 · 4 · Next »Thread · Author · Date
Box list
Apr 20141
Jan 201410
Sep 20132
Aug 20132
Apr 20131
Mar 20131
Feb 20131
Jan 201312
Dec 20127
Nov 201212
Oct 201210
Sep 20121
Aug 201214
Jul 20124
May 201281
Apr 20121
Mar 20121
Feb 20122
Jan 20123
Dec 20111
Sep 20113
Aug 201123
Jul 20118
Jun 20113
May 20114
Apr 20113
Mar 20112
Dec 20103
Nov 20103
Oct 20101
Aug 20108
Jul 201011
Jun 201048
May 201015
Apr 201011
Mar 2010598
Feb 201021
Jan 201056
Dec 20098
Nov 20094
Oct 200921
Sep 200924
Aug 2009335
Jul 200980
Jun 200944
May 2009170
Apr 2009266
Mar 2009202
Feb 2009226
Jan 2009193
Dec 200874
Nov 2008144
Oct 2008132
Sep 2008227
Aug 2008201
Jul 2008112
Jun 20086
May 2008215
Apr 2008253
Mar 200845