continuum-notifications mailing list archives

Site index · List index
Message view « Date » · « Thread »
Top « Date » · « Thread »
From "Continuum@vmbuild.apache.org" <contin...@apache.org>
Subject [continuum] BUILD FAILURE: Continuum - Continuum :: Webapp Tests - Maven 2.0.9, Java 5
Date Tue, 02 Feb 2010 06:51:54 GMT
Online report : http://vmbuild.apache.org/continuum/buildResult.action?buildId=280571&projectId=2284

Build statistics:
  State: Failed
  Previous State: Failed
  Started at: Mon 1 Feb 2010 22:45:34 -0800
  Finished at: Mon 1 Feb 2010 22:51:46 -0800
  Total time: 6m 11s
  Build Trigger: Schedule
  Build Number: 1
  Exit code: 1
  Building machine hostname: vmbuild.apache.org
  Operating system : Linux(unknown)
  Java Home version : 
          java version "1.5.0_12"
          Java(TM) 2 Runtime Environment, Standard Edition (build 1.5.0_12-b04)
          Java HotSpot(TM) Client VM (build 1.5.0_12-b04, mixed mode, sharing)
        
  Builder version :
          Maven version: 2.0.9
          Java version: 1.5.0_12
          OS name: "linux" version: "2.6.24-23-server" arch: "i386" Family: "unix"
    
****************************************************************************
SCM Changes:
****************************************************************************
Changed: ctan @ Mon 1 Feb 2010 20:03:00 -0800
Comment: [CONTINUUM-2451] update prepared-releases.xml and set releaseId in the ReleasePerform
action when doing the release with provide parameters option. releaseId is not set properly
so the ReleaseInProgress action doesn't know what release to show and where to retrieve the
release information because the prepared-releases.xml was not updated
Files changed:
  /continuum/trunk/continuum-api/src/main/java/org/apache/continuum/release/distributed/manager/DistributedReleaseManager.java
( 905508 )
  /continuum/trunk/continuum-core/src/main/java/org/apache/continuum/release/distributed/manager/DefaultDistributedReleaseManager.java
( 905508 )
  /continuum/trunk/continuum-webapp/src/main/java/org/apache/maven/continuum/web/action/ReleasePerformAction.java
( 905508 )
  /continuum/trunk/continuum-webapp-test/src/test/resources/testng.properties ( 905508 )
  /continuum/trunk/continuum-webapp-test/src/test/testng/config/testng.xml ( 905508 )
  /continuum/trunk/continuum-webapp-test/src/test/testng/org/apache/continuum/web/test/BuildAgentsTest.java
( 905508 )
  /continuum/trunk/continuum-webapp-test/src/test/testng/org/apache/continuum/web/test/ReleaseTest.java
( 905508 )
  /continuum/trunk/continuum-webapp-test/src/test/testng/org/apache/continuum/web/test/parent/AbstractReleaseTest.java
( 905508 )

****************************************************************************
Dependencies Changes:
****************************************************************************
org.apache.continuum:continuum-webapp:1.4.0-SNAPSHOT

org.apache.continuum:continuum-buildagent-webapp:1.4.0-SNAPSHOT


****************************************************************************
Build Definition:
****************************************************************************
POM filename: pom.xml
Goals: clean install   
Arguments: --batch-mode --non-recursive -U -P headless
Build Fresh: false
Always Build: false
Default Build Definition: true
Schedule: DEFAULT_SCHEDULE
Profile Name: Maven 2.0.9, Java 5
Description: Maven 2.0.9, Java 5

****************************************************************************
Test Summary:
****************************************************************************
Tests: 197
Failures: 2
Errors: 0
Success Rate: 98
Total time: 230.807

****************************************************************************
Test Failures:
****************************************************************************

TestSuite
    initializeContinuum :
  java.lang.RuntimeException
  java.lang.RuntimeException: Could not start Selenium session: Failed to start new browser
session: Error while launching browser
	at com.thoughtworks.selenium.DefaultSelenium.start(DefaultSelenium.java:89)
	at org.apache.continuum.web.test.parent.AbstractSeleniumTest.open(AbstractSeleniumTest.java:80)
	at org.apache.continuum.web.test.SetupSelenium.initializeContinuum(SetupSelenium.java:63)
Caused by: com.thoughtworks.selenium.SeleniumException: Failed to start new browser session:
Error while launching browser
	at com.thoughtworks.selenium.HttpCommandProcessor.throwAssertionFailureExceptionOrError(HttpCommandProcessor.java:97)
	at com.thoughtworks.selenium.HttpCommandProcessor.doCommand(HttpCommandProcessor.java:91)
	at com.thoughtworks.selenium.HttpCommandProcessor.getString(HttpCommandProcessor.java:262)
	at com.thoughtworks.selenium.HttpCommandProcessor.start(HttpCommandProcessor.java:223)
	at com.thoughtworks.selenium.DefaultSelenium.start(DefaultSelenium.java:81)
	... 28 more

    initializeContinuum :
  java.lang.RuntimeException
  java.lang.RuntimeException: Could not start Selenium session: Failed to start new browser
session: Error while launching browser
	at com.thoughtworks.selenium.DefaultSelenium.start(DefaultSelenium.java:89)
	at org.apache.continuum.web.test.parent.AbstractSeleniumTest.open(AbstractSeleniumTest.java:80)
	at org.apache.continuum.web.test.SetupSelenium.initializeContinuum(SetupSelenium.java:63)
Caused by: com.thoughtworks.selenium.SeleniumException: Failed to start new browser session:
Error while launching browser
	at com.thoughtworks.selenium.HttpCommandProcessor.throwAssertionFailureExceptionOrError(HttpCommandProcessor.java:97)
	at com.thoughtworks.selenium.HttpCommandProcessor.doCommand(HttpCommandProcessor.java:91)
	at com.thoughtworks.selenium.HttpCommandProcessor.getString(HttpCommandProcessor.java:262)
	at com.thoughtworks.selenium.HttpCommandProcessor.start(HttpCommandProcessor.java:223)
	at com.thoughtworks.selenium.DefaultSelenium.start(DefaultSelenium.java:81)
	... 28 more


  



Mime
View raw message