continuum-notifications mailing list archives

Site index · List index
Message view « Date » · « Thread »
Top « Date » · « Thread »
From "Continuum@vmbuild.apache.org" <contin...@apache.org>
Subject [continuum] BUILD FAILURE: Continuum - Continuum :: Webapp Tests - Maven 2.0.9, Java 5
Date Wed, 17 Feb 2010 09:51:28 GMT
Online report : http://vmbuild.apache.org/continuum/buildResult.action?buildId=284944&projectId=2284

Build statistics:
  State: Failed
  Previous State: Failed
  Started at: Wed 17 Feb 2010 00:40:01 -0800
  Finished at: Wed 17 Feb 2010 01:50:28 -0800
  Total time: 1h 10m 27s
  Build Trigger: Schedule
  Build Number: 1
  Exit code: 1
  Building machine hostname: vmbuild.apache.org
  Operating system : Linux(unknown)
  Java Home version : 
          java version "1.5.0_12"
          Java(TM) 2 Runtime Environment, Standard Edition (build 1.5.0_12-b04)
          Java HotSpot(TM) Client VM (build 1.5.0_12-b04, mixed mode, sharing)
        
  Builder version :
          Maven version: 2.0.9
          Java version: 1.5.0_12
          OS name: "linux" version: "2.6.24-23-server" arch: "i386" Family: "unix"
    
****************************************************************************
SCM Changes:
****************************************************************************
Changed: ctan @ Tue 16 Feb 2010 23:14:06 -0800
Comment: set max memory to 256
merge -r 910842 from 1.3.x branch
Files changed:
  /continuum/trunk/continuum-webapp-test/pom.xml ( 910843 )

****************************************************************************
Dependencies Changes:
****************************************************************************
No dependencies changed


****************************************************************************
Build Definition:
****************************************************************************
POM filename: pom.xml
Goals: clean install   
Arguments: --batch-mode --non-recursive -U -P headless
Build Fresh: false
Always Build: false
Default Build Definition: true
Schedule: DEFAULT_SCHEDULE
Profile Name: Maven 2.0.9, Java 5
Description: Maven 2.0.9, Java 5

****************************************************************************
Test Summary:
****************************************************************************
Tests: 196
Failures: 9
Errors: 0
Success Rate: 95
Total time: 3969.265

****************************************************************************
Test Failures:
****************************************************************************

TestSuite
    initializeContinuum :
  com.thoughtworks.selenium.SeleniumException
  com.thoughtworks.selenium.SeleniumException: Timed out after 30000ms
	at com.thoughtworks.selenium.HttpCommandProcessor.throwAssertionFailureExceptionOrError(HttpCommandProcessor.java:97)
	at com.thoughtworks.selenium.HttpCommandProcessor.doCommand(HttpCommandProcessor.java:91)
	at com.thoughtworks.selenium.DefaultSelenium.open(DefaultSelenium.java:335)
	at org.apache.continuum.web.test.SetupSelenium.initializeContinuum(SetupSelenium.java:65)

    testAddBuildDefinitionTemplate :
  com.thoughtworks.selenium.SeleniumException
  com.thoughtworks.selenium.SeleniumException: Timed out after 60000ms
	at com.thoughtworks.selenium.HttpCommandProcessor.throwAssertionFailureExceptionOrError(HttpCommandProcessor.java:97)
	at com.thoughtworks.selenium.HttpCommandProcessor.doCommand(HttpCommandProcessor.java:91)
	at com.thoughtworks.selenium.DefaultSelenium.waitForPageToLoad(DefaultSelenium.java:635)
	at org.apache.continuum.web.test.parent.AbstractSeleniumTest.waitPage(AbstractSeleniumTest.java:229)
	at org.apache.continuum.web.test.parent.AbstractSeleniumTest.clickLinkWithLocator(AbstractSeleniumTest.java:361)
	at org.apache.continuum.web.test.parent.AbstractSeleniumTest.clickLinkWithLocator(AbstractSeleniumTest.java:352)
	at org.apache.continuum.web.test.parent.AbstractSeleniumTest.clickSubmitWithLocator(AbstractSeleniumTest.java:317)
	at org.apache.continuum.web.test.parent.AbstractBuildDefinitionTemplateTest.goToAddBuildDefinitionTemplate(AbstractBuildDefinitionTemplateTest.java:132)
	at org.apache.continuum.web.test.BuildDefinitionTemplateTest.testAddBuildDefinitionTemplate(BuildDefinitionTemplateTest.java:80)

    testAddProjectGroup2 :
  com.thoughtworks.selenium.SeleniumException
  com.thoughtworks.selenium.SeleniumException: Timed out after 30000ms
	at com.thoughtworks.selenium.HttpCommandProcessor.throwAssertionFailureExceptionOrError(HttpCommandProcessor.java:97)
	at com.thoughtworks.selenium.HttpCommandProcessor.doCommand(HttpCommandProcessor.java:91)
	at com.thoughtworks.selenium.DefaultSelenium.open(DefaultSelenium.java:335)
	at org.apache.continuum.web.test.parent.AbstractContinuumTest.goToProjectGroupsSummaryPage(AbstractContinuumTest.java:213)
	at org.apache.continuum.web.test.parent.AbstractContinuumTest.addProjectGroup(AbstractContinuumTest.java:285)
	at org.apache.continuum.web.test.ProjectGroupTest.testAddProjectGroup2(ProjectGroupTest.java:55)


    testDeleteMavenOneProject :
  com.thoughtworks.selenium.SeleniumException
  com.thoughtworks.selenium.SeleniumException: Timed out after 60000ms
	at com.thoughtworks.selenium.HttpCommandProcessor.throwAssertionFailureExceptionOrError(HttpCommandProcessor.java:97)
	at com.thoughtworks.selenium.HttpCommandProcessor.doCommand(HttpCommandProcessor.java:91)
	at com.thoughtworks.selenium.DefaultSelenium.waitForPageToLoad(DefaultSelenium.java:635)
	at org.apache.continuum.web.test.parent.AbstractSeleniumTest.waitPage(AbstractSeleniumTest.java:229)
	at org.apache.continuum.web.test.parent.AbstractSeleniumTest.clickLinkWithLocator(AbstractSeleniumTest.java:361)
	at org.apache.continuum.web.test.parent.AbstractSeleniumTest.clickLinkWithText(AbstractSeleniumTest.java:337)
	at org.apache.continuum.web.test.parent.AbstractSeleniumTest.clickLinkWithText(AbstractSeleniumTest.java:332)
	at org.apache.continuum.web.test.parent.AbstractContinuumTest.removeProjectGroup(AbstractContinuumTest.java:337)
	at org.apache.continuum.web.test.MavenOneProjectTest.testDeleteMavenOneProject(MavenOneProjectTest.java:206)

    testProjectGroupAllBuildSuccess :
  java.lang.AssertionError
  java.lang.AssertionError: 'BUILD SUCCESSFUL' isn't present. expected:<true> but was:<false>
	at org.testng.Assert.fail(Assert.java:84)
	at org.testng.Assert.failNotEquals(Assert.java:438)
	at org.testng.Assert.assertTrue(Assert.java:32)
	at org.apache.continuum.web.test.parent.AbstractSeleniumTest.assertTextPresent(AbstractSeleniumTest.java:160)
	at org.apache.continuum.web.test.parent.AbstractContinuumTest.buildProjectGroup(AbstractContinuumTest.java:397)
	at org.apache.continuum.web.test.ProjectGroupTest.testProjectGroupAllBuildSuccess(ProjectGroupTest.java:141)

    testEditValidWagonProjectNotifier :
  com.thoughtworks.selenium.SeleniumException
  com.thoughtworks.selenium.SeleniumException: Timed out after 60000ms
	at com.thoughtworks.selenium.HttpCommandProcessor.throwAssertionFailureExceptionOrError(HttpCommandProcessor.java:97)
	at com.thoughtworks.selenium.HttpCommandProcessor.doCommand(HttpCommandProcessor.java:91)
	at com.thoughtworks.selenium.DefaultSelenium.waitForPageToLoad(DefaultSelenium.java:635)
	at org.apache.continuum.web.test.parent.AbstractSeleniumTest.waitPage(AbstractSeleniumTest.java:229)
	at org.apache.continuum.web.test.parent.AbstractSeleniumTest.clickLinkWithLocator(AbstractSeleniumTest.java:361)
	at org.apache.continuum.web.test.parent.AbstractSeleniumTest.clickLinkWithXPath(AbstractSeleniumTest.java:347)
	at org.apache.continuum.web.test.parent.AbstractSeleniumTest.clickLinkWithXPath(AbstractSeleniumTest.java:342)
	at org.apache.continuum.web.test.parent.AbstractNotifierTest.editWagonNotifier(AbstractNotifierTest.java:459)
	at org.apache.continuum.web.test.NotifierTest.testEditValidWagonProjectNotifier(NotifierTest.java:493)

    testEditInvalidWagonProjectNotifier :
  java.lang.AssertionError
  java.lang.AssertionError: 'link=Show Project Groups' isn't present. expected:<true>
but was:<false>
	at org.testng.Assert.fail(Assert.java:84)
	at org.testng.Assert.failNotEquals(Assert.java:438)
	at org.testng.Assert.assertTrue(Assert.java:32)
	at org.apache.continuum.web.test.parent.AbstractSeleniumTest.assertElementPresent(AbstractSeleniumTest.java:170)
	at org.apache.continuum.web.test.parent.AbstractSeleniumTest.clickLinkWithLocator(AbstractSeleniumTest.java:357)
	at org.apache.continuum.web.test.parent.AbstractSeleniumTest.clickLinkWithText(AbstractSeleniumTest.java:337)
	at org.apache.continuum.web.test.parent.AbstractSeleniumTest.clickLinkWithText(AbstractSeleniumTest.java:332)
	at org.apache.continuum.web.test.parent.AbstractContinuumTest.goToProjectInformationPage(AbstractContinuumTest.java:554)
	at org.apache.continuum.web.test.NotifierTest.testEditInvalidWagonProjectNotifier(NotifierTest.java:505)


    testQueuePageWithProjectCurrentlyBuilding :
  java.lang.AssertionError
  java.lang.AssertionError: timeout
	at org.testng.Assert.fail(Assert.java:84)
	at org.apache.continuum.web.test.parent.AbstractSeleniumTest.waitForElementPresent(AbstractSeleniumTest.java:419)
	at org.apache.continuum.web.test.parent.AbstractBuildQueueTest.buildProjectForQueuePageTest(AbstractBuildQueueTest.java:93)
	at org.apache.continuum.web.test.QueueTest.testQueuePageWithProjectCurrentlyBuilding(QueueTest.java:133)


    testAddUserWithGuestRole :
  com.thoughtworks.selenium.SeleniumException
  com.thoughtworks.selenium.SeleniumException: Timed out after 30000ms
	at com.thoughtworks.selenium.HttpCommandProcessor.throwAssertionFailureExceptionOrError(HttpCommandProcessor.java:97)
	at com.thoughtworks.selenium.HttpCommandProcessor.doCommand(HttpCommandProcessor.java:91)
	at com.thoughtworks.selenium.DefaultSelenium.open(DefaultSelenium.java:335)
	at org.apache.continuum.web.test.parent.AbstractContinuumTest.goToLoginPage(AbstractContinuumTest.java:87)
	at org.apache.continuum.web.test.parent.AbstractUserRolesManagementTest.login(AbstractUserRolesManagementTest.java:314)
	at org.apache.continuum.web.test.parent.AbstractUserRolesManagementTest.login(AbstractUserRolesManagementTest.java:307)
	at org.apache.continuum.web.test.UserRolesManagementTest.testAddUserWithGuestRole(UserRolesManagementTest.java:39)

  



Mime
View raw message