continuum-notifications mailing list archives

Site index · List index
Message view « Date » · « Thread »
Top « Date » · « Thread »
From "Continuum@vmbuild.apache.org" <contin...@apache.org>
Subject [continuum] BUILD FAILURE: Continuum - Continuum :: Webapp Tests - Maven 2.0.9, Java 5
Date Tue, 23 Feb 2010 19:09:33 GMT
Online report : http://vmbuild.apache.org/continuum/buildResult.action?buildId=287601&projectId=2284

Build statistics:
  State: Failed
  Previous State: Failed
  Started at: Tue 23 Feb 2010 09:57:51 -0800
  Finished at: Tue 23 Feb 2010 11:09:02 -0800
  Total time: 1h 11m 10s
  Build Trigger: Schedule
  Build Number: 1
  Exit code: 1
  Building machine hostname: vmbuild.apache.org
  Operating system : Linux(unknown)
  Java Home version : 
          java version "1.5.0_12"
          Java(TM) 2 Runtime Environment, Standard Edition (build 1.5.0_12-b04)
          Java HotSpot(TM) Client VM (build 1.5.0_12-b04, mixed mode, sharing)
        
  Builder version :
          Maven version: 2.0.9
          Java version: 1.5.0_12
          OS name: "linux" version: "2.6.24-23-server" arch: "i386" Family: "unix"
    
****************************************************************************
SCM Changes:
****************************************************************************
No files changed

****************************************************************************
Dependencies Changes:
****************************************************************************
org.apache.continuum:continuum-webapp:1.4.0-SNAPSHOT

org.apache.continuum:continuum-buildagent-webapp:1.4.0-SNAPSHOT

org.apache.continuum:continuum:1.4.0-SNAPSHOT


****************************************************************************
Build Definition:
****************************************************************************
POM filename: pom.xml
Goals: clean install   
Arguments: --batch-mode --non-recursive -U -P headless
Build Fresh: false
Always Build: false
Default Build Definition: true
Schedule: DEFAULT_SCHEDULE
Profile Name: Maven 2.0.9, Java 5
Description: Maven 2.0.9, Java 5

****************************************************************************
Test Summary:
****************************************************************************
Tests: 195
Failures: 8
Errors: 0
Success Rate: 95
Total time: 4042.99

****************************************************************************
Test Failures:
****************************************************************************

TestSuite
    testAddValidMailGroupNotifier :
  com.thoughtworks.selenium.SeleniumException
  com.thoughtworks.selenium.SeleniumException: Timed out after 30000ms
	at com.thoughtworks.selenium.HttpCommandProcessor.throwAssertionFailureExceptionOrError(HttpCommandProcessor.java:97)
	at com.thoughtworks.selenium.HttpCommandProcessor.doCommand(HttpCommandProcessor.java:91)
	at com.thoughtworks.selenium.DefaultSelenium.open(DefaultSelenium.java:335)
	at org.apache.continuum.web.test.parent.AbstractContinuumTest.goToProjectGroupsSummaryPage(AbstractContinuumTest.java:213)
	at org.apache.continuum.web.test.parent.AbstractContinuumTest.showProjectGroup(AbstractContinuumTest.java:242)
	at org.apache.continuum.web.test.parent.AbstractNotifierTest.goToGroupNotifier(AbstractNotifierTest.java:160)
	at org.apache.continuum.web.test.NotifierTest.testAddValidMailGroupNotifier(NotifierTest.java:83)

    testAddValidIrcGroupNotifier :
  com.thoughtworks.selenium.SeleniumException
  com.thoughtworks.selenium.SeleniumException: ERROR: Element link=Test Project Group Name
not found
	at com.thoughtworks.selenium.HttpCommandProcessor.throwAssertionFailureExceptionOrError(HttpCommandProcessor.java:97)
	at com.thoughtworks.selenium.HttpCommandProcessor.doCommand(HttpCommandProcessor.java:91)
	at com.thoughtworks.selenium.DefaultSelenium.click(DefaultSelenium.java:167)
	at org.apache.continuum.web.test.parent.AbstractSeleniumTest.clickLinkWithLocator(AbstractSeleniumTest.java:358)
	at org.apache.continuum.web.test.parent.AbstractSeleniumTest.clickLinkWithText(AbstractSeleniumTest.java:337)
	at org.apache.continuum.web.test.parent.AbstractSeleniumTest.clickLinkWithText(AbstractSeleniumTest.java:332)
	at org.apache.continuum.web.test.parent.AbstractContinuumTest.showProjectGroup(AbstractContinuumTest.java:246)
	at org.apache.continuum.web.test.parent.AbstractNotifierTest.goToGroupNotifier(AbstractNotifierTest.java:160)
	at org.apache.continuum.web.test.NotifierTest.testAddValidIrcGroupNotifier(NotifierTest.java:184)

    testAddMavenTwoProjectModuleNameWithSameLetter :
  java.lang.AssertionError
  java.lang.AssertionError: 'Group Actions' isn't present. expected:<true> but was:<false>
	at org.testng.Assert.fail(Assert.java:84)
	at org.testng.Assert.failNotEquals(Assert.java:438)
	at org.testng.Assert.assertTrue(Assert.java:32)
	at org.apache.continuum.web.test.parent.AbstractSeleniumTest.assertTextPresent(AbstractSeleniumTest.java:160)
	at org.apache.continuum.web.test.parent.AbstractContinuumTest.assertProjectGroupSummaryPage(AbstractContinuumTest.java:262)
	at org.apache.continuum.web.test.MavenTwoProjectTest.testAddMavenTwoProjectModuleNameWithSameLetter(MavenTwoProjectTest.java:102)

    testProjectGroupAllBuildSuccessWithDistributedBuilds :
  java.lang.AssertionError
  java.lang.AssertionError: 'link=Result' isn't present. expected:<true> but was:<false>
	at org.testng.Assert.fail(Assert.java:84)
	at org.testng.Assert.failNotEquals(Assert.java:438)
	at org.testng.Assert.assertTrue(Assert.java:32)
	at org.apache.continuum.web.test.parent.AbstractSeleniumTest.assertElementPresent(AbstractSeleniumTest.java:170)
	at org.apache.continuum.web.test.parent.AbstractSeleniumTest.clickLinkWithLocator(AbstractSeleniumTest.java:357)
	at org.apache.continuum.web.test.parent.AbstractSeleniumTest.clickLinkWithText(AbstractSeleniumTest.java:337)
	at org.apache.continuum.web.test.parent.AbstractSeleniumTest.clickLinkWithText(AbstractSeleniumTest.java:332)
	at org.apache.continuum.web.test.parent.AbstractContinuumTest.buildProjectGroup(AbstractContinuumTest.java:396)
	at org.apache.continuum.web.test.ProjectGroupTest.testProjectGroupAllBuildSuccessWithDistributedBuilds(ProjectGroupTest.java:159)

    testAddBuildQueue :
  java.lang.AssertionError
  java.lang.AssertionError: 'link=Build Queue' isn't present. expected:<true> but was:<false>
	at org.testng.Assert.fail(Assert.java:84)
	at org.testng.Assert.failNotEquals(Assert.java:438)
	at org.testng.Assert.assertTrue(Assert.java:32)
	at org.apache.continuum.web.test.parent.AbstractSeleniumTest.assertElementPresent(AbstractSeleniumTest.java:170)
	at org.apache.continuum.web.test.parent.AbstractSeleniumTest.clickLinkWithLocator(AbstractSeleniumTest.java:357)
	at org.apache.continuum.web.test.parent.AbstractSeleniumTest.clickLinkWithText(AbstractSeleniumTest.java:337)
	at org.apache.continuum.web.test.parent.AbstractSeleniumTest.clickLinkWithText(AbstractSeleniumTest.java:332)
	at org.apache.continuum.web.test.parent.AbstractBuildQueueTest.goToBuildQueuePage(AbstractBuildQueueTest.java:33)
	at org.apache.continuum.web.test.parent.AbstractBuildQueueTest.addBuildQueue(AbstractBuildQueueTest.java:71)
	at org.apache.continuum.web.test.QueueTest.testAddBuildQueue(QueueTest.java:42)

    testDeleteSchedule :
  java.lang.AssertionError
  java.lang.AssertionError: expected:<Continuum - Schedules> but was:<Continuum -
Edit Schedule>
	at org.testng.Assert.fail(Assert.java:84)
	at org.testng.Assert.failNotEquals(Assert.java:438)
	at org.testng.Assert.assertEquals(Assert.java:108)
	at org.testng.Assert.assertEquals(Assert.java:129)
	at org.testng.Assert.assertEquals(Assert.java:139)
	at org.apache.continuum.web.test.parent.AbstractSeleniumTest.assertPage(AbstractSeleniumTest.java:145)
	at org.apache.continuum.web.test.parent.AbstractScheduleTest.assertSchedulePage(AbstractScheduleTest.java:45)
	at org.apache.continuum.web.test.parent.AbstractScheduleTest.removeSchedule(AbstractScheduleTest.java:173)
	at org.apache.continuum.web.test.ScheduleTest.testDeleteSchedule(ScheduleTest.java:142)


    testQueuePageWithProjectCurrentlyBuilding :
  java.lang.AssertionError
  java.lang.AssertionError: timeout
	at org.testng.Assert.fail(Assert.java:84)
	at org.apache.continuum.web.test.parent.AbstractSeleniumTest.waitForElementPresent(AbstractSeleniumTest.java:419)
	at org.apache.continuum.web.test.parent.AbstractBuildQueueTest.buildProjectForQueuePageTest(AbstractBuildQueueTest.java:93)
	at org.apache.continuum.web.test.QueueTest.testQueuePageWithProjectCurrentlyBuilding(QueueTest.java:133)


    testAddUserWithContinuumGroupProjectAdminRole :
  com.thoughtworks.selenium.SeleniumException
  com.thoughtworks.selenium.SeleniumException: Timed out after 60000ms
	at com.thoughtworks.selenium.HttpCommandProcessor.throwAssertionFailureExceptionOrError(HttpCommandProcessor.java:97)
	at com.thoughtworks.selenium.HttpCommandProcessor.doCommand(HttpCommandProcessor.java:91)
	at com.thoughtworks.selenium.DefaultSelenium.waitForPageToLoad(DefaultSelenium.java:635)
	at org.apache.continuum.web.test.parent.AbstractSeleniumTest.waitPage(AbstractSeleniumTest.java:229)
	at org.apache.continuum.web.test.parent.AbstractSeleniumTest.clickLinkWithLocator(AbstractSeleniumTest.java:361)
	at org.apache.continuum.web.test.parent.AbstractSeleniumTest.clickLinkWithText(AbstractSeleniumTest.java:337)
	at org.apache.continuum.web.test.parent.AbstractSeleniumTest.clickLinkWithText(AbstractSeleniumTest.java:332)
	at org.apache.continuum.web.test.parent.AbstractUserRolesManagementTest.assertCreatedUserInfo(AbstractUserRolesManagementTest.java:90)
	at org.apache.continuum.web.test.UserRolesManagementTest.testAddUserWithContinuumGroupProjectAdminRole(UserRolesManagementTest.java:213)

  



Mime
View raw message