continuum-notifications mailing list archives

Site index · List index
Message view « Date » · « Thread »
Top « Date » · « Thread »
From "Continuum@vmbuild.apache.org" <contin...@apache.org>
Subject [continuum] BUILD FAILURE: Continuum - Continuum :: Webapp Tests - Maven 2.0.9, Java 5
Date Wed, 17 Feb 2010 11:32:16 GMT
Online report : http://vmbuild.apache.org/continuum/buildResult.action?buildId=284972&projectId=2284

Build statistics:
  State: Failed
  Previous State: Failed
  Started at: Wed 17 Feb 2010 02:17:52 -0800
  Finished at: Wed 17 Feb 2010 03:31:53 -0800
  Total time: 1h 14m 0s
  Build Trigger: Schedule
  Build Number: 1
  Exit code: 1
  Building machine hostname: vmbuild.apache.org
  Operating system : Linux(unknown)
  Java Home version : 
          java version "1.5.0_12"
          Java(TM) 2 Runtime Environment, Standard Edition (build 1.5.0_12-b04)
          Java HotSpot(TM) Client VM (build 1.5.0_12-b04, mixed mode, sharing)
        
  Builder version :
          Maven version: 2.0.9
          Java version: 1.5.0_12
          OS name: "linux" version: "2.6.24-23-server" arch: "i386" Family: "unix"
    
****************************************************************************
SCM Changes:
****************************************************************************
Changed: ctan @ Tue 16 Feb 2010 23:14:06 -0800
Comment: set max memory to 256
merge -r 910842 from 1.3.x branch
Files changed:
  /continuum/trunk/continuum-webapp-test/pom.xml ( 910843 )

Changed: ctan @ Tue 9 Feb 2010 18:03:10 -0800
Comment: prevent selenium tests from running infinitely when release failed
Files changed:
  /continuum/trunk/continuum-webapp-test/src/test/testng/org/apache/continuum/web/test/parent/AbstractReleaseTest.java
( 908316 )

Changed: jzurbano @ Fri 5 Feb 2010 19:25:24 -0800
Comment: [CONTINUUM-2397] - Unable to edit the added local repository
* trim() repository name and location when comparing for duplicates and before saving
* added selenium test on adding duplicate repository with trailing spaces; adjusted the dependsOnMethods
of the tests

Submitted by: Garry Baal
Files changed:
  /continuum/trunk/continuum-webapp/src/main/java/org/apache/continuum/web/action/admin/LocalRepositoryAction.java
( 907163 )
  /continuum/trunk/continuum-webapp-test/src/test/testng/org/apache/continuum/web/test/LocalRepositoriesTest.java
( 907163 )

Changed: ctan @ Mon 1 Feb 2010 20:03:00 -0800
Comment: [CONTINUUM-2451] update prepared-releases.xml and set releaseId in the ReleasePerform
action when doing the release with provide parameters option. releaseId is not set properly
so the ReleaseInProgress action doesn't know what release to show and where to retrieve the
release information because the prepared-releases.xml was not updated
Files changed:
  /continuum/trunk/continuum-api/src/main/java/org/apache/continuum/release/distributed/manager/DistributedReleaseManager.java
( 905508 )
  /continuum/trunk/continuum-core/src/main/java/org/apache/continuum/release/distributed/manager/DefaultDistributedReleaseManager.java
( 905508 )
  /continuum/trunk/continuum-webapp/src/main/java/org/apache/maven/continuum/web/action/ReleasePerformAction.java
( 905508 )
  /continuum/trunk/continuum-webapp-test/src/test/resources/testng.properties ( 905508 )
  /continuum/trunk/continuum-webapp-test/src/test/testng/config/testng.xml ( 905508 )
  /continuum/trunk/continuum-webapp-test/src/test/testng/org/apache/continuum/web/test/BuildAgentsTest.java
( 905508 )
  /continuum/trunk/continuum-webapp-test/src/test/testng/org/apache/continuum/web/test/ReleaseTest.java
( 905508 )
  /continuum/trunk/continuum-webapp-test/src/test/testng/org/apache/continuum/web/test/parent/AbstractReleaseTest.java
( 905508 )

Changed: no author @ Mon 1 Feb 2010 20:03:00 -0800
Comment: no comment
Files changed:
  src/appserver-base/conf/continuum-buildagent.xml ( no revision )
  src/test/testng/config/testng.xml ( no revision )
  src/test/testng/org/apache/continuum/web/test/BuildAgentsTest.java ( no revision )
  src/test/testng/org/apache/continuum/web/test/parent/AbstractReleaseTest.java ( no revision
)
  src/test/testng/org/apache/continuum/web/test/parent/AbstractBuildAgentsTest.java ( no revision
)
  src/test/testng/org/apache/continuum/web/test/parent/AbstractContinuumTest.java ( no revision
)
  src/test/testng/org/apache/continuum/web/test/parent/AbstractSeleniumTest.java ( no revision
)
  src/test/testng/org/apache/continuum/web/test/ReleaseTest.java ( no revision )
  src/test/testng/org/apache/continuum/web/test/ProjectGroupTest.java ( no revision )
  src/test/testng/org/apache/continuum/web/test/MavenTwoProjectTest.java ( no revision )
  src/test/resources/testng.properties ( no revision )
  pom.xml ( no revision )

Changed: brett @ Sun 17 Jan 2010 19:50:27 -0800
Comment: merge recent changes from 1.3.x branch
Files changed:
  /continuum/trunk ( 900276 )
  /continuum/trunk/continuum-api/src/main/java/org/apache/continuum/taskqueue/BuildProjectTask.java
( 900276 )
  /continuum/trunk/continuum-api/src/main/java/org/apache/continuum/taskqueue/CheckOutTask.java
( 900276 )
  /continuum/trunk/continuum-api/src/main/java/org/apache/continuum/taskqueue/PrepareBuildProjectsTask.java
( 900276 )
  /continuum/trunk/continuum-buildagent/continuum-buildagent-core/src/main/java/org/apache/continuum/buildagent/build/execution/manager/BuildAgentBuildExecutorManager.java
( 900276 )
  /continuum/trunk/continuum-buildagent/continuum-buildagent-core/src/main/java/org/apache/continuum/buildagent/build/execution/manager/DefaultBuildAgentBuildExecutorManager.java
( 900276 )
  /continuum/trunk/continuum-buildagent/continuum-buildagent-core/src/main/java/org/apache/continuum/buildagent/build/execution/maven/m1
( 900276 )
  /continuum/trunk/continuum-buildagent/continuum-buildagent-core/src/main/java/org/apache/continuum/buildagent/build/execution/maven/m2/BuildAgentMavenBuilderHelper.java
( 900276 )
  /continuum/trunk/continuum-buildagent/continuum-buildagent-core/src/main/java/org/apache/continuum/buildagent/build/execution/maven/m2/DefaultBuildAgentMavenBuilderHelper.java
( 900276 )
  /continuum/trunk/continuum-buildagent/continuum-buildagent-core/src/main/java/org/apache/continuum/buildagent/configuration/BuildAgentConfiguration.java
( 900276 )
  /continuum/trunk/continuum-buildagent/continuum-buildagent-core/src/main/java/org/apache/continuum/buildagent/configuration/BuildAgentConfigurationException.java
( 900276 )
  /continuum/trunk/continuum-buildagent/continuum-buildagent-core/src/main/java/org/apache/continuum/buildagent/configuration/BuildAgentConfigurationService.java
( 900276 )
  /continuum/trunk/continuum-buildagent/continuum-buildagent-core/src/main/java/org/apache/continuum/buildagent/configuration/DefaultBuildAgentConfiguration.java
( 900276 )
  /continuum/trunk/continuum-buildagent/continuum-buildagent-core/src/main/java/org/apache/continuum/buildagent/configuration/DefaultBuildAgentConfigurationService.java
( 900276 )
  /continuum/trunk/continuum-buildagent/continuum-buildagent-core/src/main/java/org/apache/continuum/buildagent/configuration/GeneralBuildAgentConfiguration.java
( 900276 )
  /continuum/trunk/continuum-buildagent/continuum-buildagent-core/src/main/java/org/apache/continuum/buildagent/installation/BuildAgentInstallationService.java
( 900276 )
  /continuum/trunk/continuum-buildagent/continuum-buildagent-core/src/main/java/org/apache/continuum/buildagent/installation/DefaultBuildAgentInstallationService.java
( 900276 )
  /continuum/trunk/continuum-buildagent/continuum-buildagent-core/src/main/java/org/apache/continuum/buildagent/manager/BuildAgentManager.java
( 900276 )
  /continuum/trunk/continuum-buildagent/continuum-buildagent-core/src/main/java/org/apache/continuum/buildagent/manager/DefaultBuildAgentManager.java
( 900276 )
  /continuum/trunk/continuum-buildagent/continuum-buildagent-core/src/main/java/org/apache/continuum/buildagent/taskqueue/manager/BuildAgentTaskQueueManager.java
( 900276 )
  /continuum/trunk/continuum-buildagent/continuum-buildagent-core/src/main/java/org/apache/continuum/buildagent/taskqueue/manager/DefaultBuildAgentTaskQueueManager.java
( 900276 )
  /continuum/trunk/continuum-builder/src/main/java/org/apache/continuum/builder/distributed/executor/DistributedBuildProjectTaskExecutor.java
( 900276 )
  /continuum/trunk/continuum-builder/src/main/java/org/apache/continuum/builder/distributed/executor/ThreadedDistributedBuildTaskQueueExecutor.java
( 900276 )
  /continuum/trunk/continuum-data-management/data-management-cli ( 900276 )
  /continuum/trunk/continuum-docs/src/site/apt/user_guides/release/release_results.apt ( 900276
)
  /continuum/trunk/continuum-docs/src/site/xdoc ( 900276 )
  /continuum/trunk/continuum-model/src/main/resources/package-default.orm ( 900276 )
  /continuum/trunk/continuum-webapp/pom.xml ( 900276 )
  /continuum/trunk/continuum-webapp/src/main/java/org/apache/continuum/web/action/admin/BuildAgentAction.java
( 900276 )
  /continuum/trunk/continuum-webapp/src/main/webapp/WEB-INF/jsp/admin/confirmDeleteBuildAgent.jsp
( 900276 )
  /continuum/trunk/continuum-webapp-test/src/test/selenium-ide ( 900276 )
  /continuum/trunk/continuum-webapp-test/src/test/testng/org/apache/continuum/web/test/listener/CaptureScreenShotsListener.java
( 900276 )
  /continuum/trunk/src/site ( 900276 )

Changed: ctan @ Mon 11 Jan 2010 18:25:34 -0800
Comment: [CONTINUUM-2411] do not throw exception when there is no default build definition
in the template. only log a warning saying that project cannot be checked out without a build
definition
merge -r 898152:898153 of 1.3.x branch
Files changed:
  /continuum/trunk/continuum-core/src/main/java/org/apache/maven/continuum/DefaultContinuum.java
( 898154 )
  /continuum/trunk/continuum-webapp-test/src/test/testng/org/apache/continuum/web/test/MavenOneProjectTest.java
( 898154 )
  /continuum/trunk/continuum-webapp-test/src/test/testng/org/apache/continuum/web/test/MavenTwoProjectTest.java
( 898154 )
  /continuum/trunk/continuum-webapp-test/src/test/testng/org/apache/continuum/web/test/parent/AbstractContinuumTest.java
( 898154 )
  /continuum/trunk/continuum-webapp-test/src/test/testng/org/apache/continuum/web/test/parent/AbstractSeleniumTest.java
( 898154 )

****************************************************************************
Dependencies Changes:
****************************************************************************
No dependencies changed


****************************************************************************
Build Definition:
****************************************************************************
POM filename: pom.xml
Goals: clean install   
Arguments: --batch-mode --non-recursive -U -P headless
Build Fresh: false
Always Build: false
Default Build Definition: true
Schedule: DEFAULT_SCHEDULE
Profile Name: Maven 2.0.9, Java 5
Description: Maven 2.0.9, Java 5

****************************************************************************
Test Summary:
****************************************************************************
Tests: 196
Failures: 7
Errors: 0
Success Rate: 96
Total time: 4093.4731

****************************************************************************
Test Failures:
****************************************************************************

TestSuite
    testEditInvalidIrcGroupNotifier :
  com.thoughtworks.selenium.SeleniumException
  com.thoughtworks.selenium.SeleniumException: Timed out after 60000ms
	at com.thoughtworks.selenium.HttpCommandProcessor.throwAssertionFailureExceptionOrError(HttpCommandProcessor.java:97)
	at com.thoughtworks.selenium.HttpCommandProcessor.doCommand(HttpCommandProcessor.java:91)
	at com.thoughtworks.selenium.DefaultSelenium.waitForPageToLoad(DefaultSelenium.java:635)
	at org.apache.continuum.web.test.parent.AbstractSeleniumTest.waitPage(AbstractSeleniumTest.java:229)
	at org.apache.continuum.web.test.parent.AbstractSeleniumTest.clickLinkWithLocator(AbstractSeleniumTest.java:361)
	at org.apache.continuum.web.test.parent.AbstractSeleniumTest.clickLinkWithText(AbstractSeleniumTest.java:337)
	at org.apache.continuum.web.test.parent.AbstractSeleniumTest.clickLinkWithText(AbstractSeleniumTest.java:332)
	at org.apache.continuum.web.test.parent.AbstractContinuumTest.showProjectGroup(AbstractContinuumTest.java:246)
	at org.apache.continuum.web.test.NotifierTest.testEditInvalidIrcGroupNotifier(NotifierTest.java:215)

    testProjectGroupAllBuildSuccessWithDistributedBuilds :
  java.lang.AssertionError
  java.lang.AssertionError: 'link=Result' isn't present. expected:<true> but was:<false>
	at org.testng.Assert.fail(Assert.java:84)
	at org.testng.Assert.failNotEquals(Assert.java:438)
	at org.testng.Assert.assertTrue(Assert.java:32)
	at org.apache.continuum.web.test.parent.AbstractSeleniumTest.assertElementPresent(AbstractSeleniumTest.java:170)
	at org.apache.continuum.web.test.parent.AbstractSeleniumTest.clickLinkWithLocator(AbstractSeleniumTest.java:357)
	at org.apache.continuum.web.test.parent.AbstractSeleniumTest.clickLinkWithText(AbstractSeleniumTest.java:337)
	at org.apache.continuum.web.test.parent.AbstractSeleniumTest.clickLinkWithText(AbstractSeleniumTest.java:332)
	at org.apache.continuum.web.test.parent.AbstractContinuumTest.buildProjectGroup(AbstractContinuumTest.java:396)
	at org.apache.continuum.web.test.ProjectGroupTest.testProjectGroupAllBuildSuccessWithDistributedBuilds(ProjectGroupTest.java:159)


    testAddInvalidJabberGroupNotifier :
  com.thoughtworks.selenium.SeleniumException
  com.thoughtworks.selenium.SeleniumException: ERROR: Couldn't access document.body.  Is this
HTML page fully loaded?
	at com.thoughtworks.selenium.HttpCommandProcessor.throwAssertionFailureExceptionOrError(HttpCommandProcessor.java:97)
	at com.thoughtworks.selenium.HttpCommandProcessor.doCommand(HttpCommandProcessor.java:91)
	at com.thoughtworks.selenium.HttpCommandProcessor.getString(HttpCommandProcessor.java:262)
	at com.thoughtworks.selenium.HttpCommandProcessor.getBoolean(HttpCommandProcessor.java:335)
	at com.thoughtworks.selenium.DefaultSelenium.isTextPresent(DefaultSelenium.java:499)
	at org.apache.continuum.web.test.parent.AbstractSeleniumTest.assertTextPresent(AbstractSeleniumTest.java:160)
	at org.apache.continuum.web.test.parent.AbstractContinuumTest.assertProjectGroupSummaryPage(AbstractContinuumTest.java:257)
	at org.apache.continuum.web.test.parent.AbstractContinuumTest.showProjectGroup(AbstractContinuumTest.java:248)
	at org.apache.continuum.web.test.parent.AbstractNotifierTest.goToGroupNotifier(AbstractNotifierTest.java:160)
	at org.apache.continuum.web.test.NotifierTest.testAddInvalidJabberGroupNotifier(NotifierTest.java:351)


    testMyAccountEdit :
  java.lang.AssertionError
  java.lang.AssertionError: 'link=Edit Details' isn't present. expected:<true> but was:<false>
	at org.testng.Assert.fail(Assert.java:84)
	at org.testng.Assert.failNotEquals(Assert.java:438)
	at org.testng.Assert.assertTrue(Assert.java:32)
	at org.apache.continuum.web.test.parent.AbstractSeleniumTest.assertElementPresent(AbstractSeleniumTest.java:170)
	at org.apache.continuum.web.test.parent.AbstractSeleniumTest.clickLinkWithLocator(AbstractSeleniumTest.java:357)
	at org.apache.continuum.web.test.parent.AbstractSeleniumTest.clickLinkWithText(AbstractSeleniumTest.java:337)
	at org.apache.continuum.web.test.parent.AbstractSeleniumTest.clickLinkWithText(AbstractSeleniumTest.java:332)
	at org.apache.continuum.web.test.MyAccountTest.testMyAccountEdit(MyAccountTest.java:44)

    testAddValidWagonProjectNotifier :
  java.lang.AssertionError
  java.lang.AssertionError: 'link=Show Project Groups' isn't present. expected:<true>
but was:<false>
	at org.testng.Assert.fail(Assert.java:84)
	at org.testng.Assert.failNotEquals(Assert.java:438)
	at org.testng.Assert.assertTrue(Assert.java:32)
	at org.apache.continuum.web.test.parent.AbstractSeleniumTest.assertElementPresent(AbstractSeleniumTest.java:170)
	at org.apache.continuum.web.test.parent.AbstractSeleniumTest.clickLinkWithLocator(AbstractSeleniumTest.java:357)
	at org.apache.continuum.web.test.parent.AbstractSeleniumTest.clickLinkWithText(AbstractSeleniumTest.java:337)
	at org.apache.continuum.web.test.parent.AbstractSeleniumTest.clickLinkWithText(AbstractSeleniumTest.java:332)
	at org.apache.continuum.web.test.parent.AbstractContinuumTest.goToProjectInformationPage(AbstractContinuumTest.java:554)
	at org.apache.continuum.web.test.parent.AbstractNotifierTest.goToProjectNotifier(AbstractNotifierTest.java:170)
	at org.apache.continuum.web.test.NotifierTest.testAddValidWagonProjectNotifier(NotifierTest.java:476)

    testAddBuildQueue :
  java.lang.AssertionError
  java.lang.AssertionError: 'link=Build Queue' isn't present. expected:<true> but was:<false>
	at org.testng.Assert.fail(Assert.java:84)
	at org.testng.Assert.failNotEquals(Assert.java:438)
	at org.testng.Assert.assertTrue(Assert.java:32)
	at org.apache.continuum.web.test.parent.AbstractSeleniumTest.assertElementPresent(AbstractSeleniumTest.java:170)
	at org.apache.continuum.web.test.parent.AbstractSeleniumTest.clickLinkWithLocator(AbstractSeleniumTest.java:357)
	at org.apache.continuum.web.test.parent.AbstractSeleniumTest.clickLinkWithText(AbstractSeleniumTest.java:337)
	at org.apache.continuum.web.test.parent.AbstractSeleniumTest.clickLinkWithText(AbstractSeleniumTest.java:332)
	at org.apache.continuum.web.test.parent.AbstractBuildQueueTest.goToBuildQueuePage(AbstractBuildQueueTest.java:33)
	at org.apache.continuum.web.test.parent.AbstractBuildQueueTest.addBuildQueue(AbstractBuildQueueTest.java:71)
	at org.apache.continuum.web.test.QueueTest.testAddBuildQueue(QueueTest.java:42)

    testDeleteSchedule :
  java.lang.AssertionError
  java.lang.AssertionError: expected:<Continuum - Schedules> but was:<Continuum -
Edit Schedule>
	at org.testng.Assert.fail(Assert.java:84)
	at org.testng.Assert.failNotEquals(Assert.java:438)
	at org.testng.Assert.assertEquals(Assert.java:108)
	at org.testng.Assert.assertEquals(Assert.java:129)
	at org.testng.Assert.assertEquals(Assert.java:139)
	at org.apache.continuum.web.test.parent.AbstractSeleniumTest.assertPage(AbstractSeleniumTest.java:145)
	at org.apache.continuum.web.test.parent.AbstractScheduleTest.assertSchedulePage(AbstractScheduleTest.java:45)
	at org.apache.continuum.web.test.parent.AbstractScheduleTest.removeSchedule(AbstractScheduleTest.java:173)
	at org.apache.continuum.web.test.ScheduleTest.testDeleteSchedule(ScheduleTest.java:142)


  



Mime
View raw message