continuum-notifications mailing list archives

Site index · List index
Message view « Date » · « Thread »
Top « Date » · « Thread »
From "Continuum@vmbuild.apache.org" <contin...@apache.org>
Subject [continuum] BUILD FAILURE: Continuum - Continuum :: Webapp Tests - Maven 2.0.9, Java 5
Date Wed, 17 Feb 2010 01:13:11 GMT
Online report : http://vmbuild.apache.org/continuum/buildResult.action?buildId=284732&projectId=2284

Build statistics:
  State: Failed
  Previous State: Failed
  Started at: Tue 16 Feb 2010 16:07:45 -0800
  Finished at: Tue 16 Feb 2010 17:13:01 -0800
  Total time: 1h 5m 15s
  Build Trigger: Schedule
  Build Number: 1
  Exit code: 1
  Building machine hostname: vmbuild.apache.org
  Operating system : Linux(unknown)
  Java Home version : 
          java version "1.5.0_12"
          Java(TM) 2 Runtime Environment, Standard Edition (build 1.5.0_12-b04)
          Java HotSpot(TM) Client VM (build 1.5.0_12-b04, mixed mode, sharing)
        
  Builder version :
          Maven version: 2.0.9
          Java version: 1.5.0_12
          OS name: "linux" version: "2.6.24-23-server" arch: "i386" Family: "unix"
    
****************************************************************************
SCM Changes:
****************************************************************************
No files changed

****************************************************************************
Dependencies Changes:
****************************************************************************
org.apache.continuum:continuum-webapp:1.4.0-SNAPSHOT


****************************************************************************
Build Definition:
****************************************************************************
POM filename: pom.xml
Goals: clean install   
Arguments: --batch-mode --non-recursive -U -P headless
Build Fresh: false
Always Build: false
Default Build Definition: true
Schedule: DEFAULT_SCHEDULE
Profile Name: Maven 2.0.9, Java 5
Description: Maven 2.0.9, Java 5

****************************************************************************
Test Summary:
****************************************************************************
Tests: 194
Failures: 6
Errors: 0
Success Rate: 96
Total time: 3646.912

****************************************************************************
Test Failures:
****************************************************************************

TestSuite
    testMalformedPomUrl :
  com.thoughtworks.selenium.SeleniumException
  com.thoughtworks.selenium.SeleniumException: Timed out after 60000ms
	at com.thoughtworks.selenium.HttpCommandProcessor.throwAssertionFailureExceptionOrError(HttpCommandProcessor.java:97)
	at com.thoughtworks.selenium.HttpCommandProcessor.doCommand(HttpCommandProcessor.java:91)
	at com.thoughtworks.selenium.DefaultSelenium.waitForPageToLoad(DefaultSelenium.java:635)
	at org.apache.continuum.web.test.parent.AbstractSeleniumTest.waitPage(AbstractSeleniumTest.java:229)
	at org.apache.continuum.web.test.parent.AbstractSeleniumTest.clickLinkWithLocator(AbstractSeleniumTest.java:361)
	at org.apache.continuum.web.test.parent.AbstractSeleniumTest.clickLinkWithText(AbstractSeleniumTest.java:337)
	at org.apache.continuum.web.test.parent.AbstractSeleniumTest.clickLinkWithText(AbstractSeleniumTest.java:332)
	at org.apache.continuum.web.test.parent.AbstractContinuumTest.goToAddMavenOneProjectPage(AbstractContinuumTest.java:661)
	at org.apache.continuum.web.test.MavenOneProjectTest.testMalformedPomUrl(MavenOneProjectTest.java:152)

    testAddProjectGroup :
  com.thoughtworks.selenium.SeleniumException
  com.thoughtworks.selenium.SeleniumException: Timed out after 30000ms
	at com.thoughtworks.selenium.HttpCommandProcessor.throwAssertionFailureExceptionOrError(HttpCommandProcessor.java:97)
	at com.thoughtworks.selenium.HttpCommandProcessor.doCommand(HttpCommandProcessor.java:91)
	at com.thoughtworks.selenium.DefaultSelenium.open(DefaultSelenium.java:335)
	at org.apache.continuum.web.test.parent.AbstractContinuumTest.goToProjectGroupsSummaryPage(AbstractContinuumTest.java:213)
	at org.apache.continuum.web.test.parent.AbstractContinuumTest.showProjectGroup(AbstractContinuumTest.java:242)
	at org.apache.continuum.web.test.ProjectGroupTest.testAddProjectGroup(ProjectGroupTest.java:45)


    testAddMavenTwoProjectWithNoDefaultBuildDefinitionInTemplate :
  com.thoughtworks.selenium.SeleniumException
  com.thoughtworks.selenium.SeleniumException: Timed out after 60000ms
	at com.thoughtworks.selenium.HttpCommandProcessor.throwAssertionFailureExceptionOrError(HttpCommandProcessor.java:97)
	at com.thoughtworks.selenium.HttpCommandProcessor.doCommand(HttpCommandProcessor.java:91)
	at com.thoughtworks.selenium.DefaultSelenium.waitForPageToLoad(DefaultSelenium.java:635)
	at org.apache.continuum.web.test.parent.AbstractSeleniumTest.waitPage(AbstractSeleniumTest.java:229)
	at org.apache.continuum.web.test.parent.AbstractSeleniumTest.clickLinkWithLocator(AbstractSeleniumTest.java:361)
	at org.apache.continuum.web.test.parent.AbstractSeleniumTest.clickLinkWithXPath(AbstractSeleniumTest.java:347)
	at org.apache.continuum.web.test.parent.AbstractSeleniumTest.clickLinkWithXPath(AbstractSeleniumTest.java:342)
	at org.apache.continuum.web.test.parent.AbstractSeleniumTest.submit(AbstractSeleniumTest.java:267)
	at org.apache.continuum.web.test.parent.AbstractContinuumTest.addDefaultBuildDefinitionFromTemplate(AbstractContinuumTest.java:939)
	at org.apache.continuum.web.test.MavenTwoProjectTest.testAddMavenTwoProjectWithNoDefaultBuildDefinitionInTemplate(MavenTwoProjectTest.java:60)


    testProjectGroupMembers :
  com.thoughtworks.selenium.SeleniumException
  com.thoughtworks.selenium.SeleniumException: Timed out after 30000ms
	at com.thoughtworks.selenium.HttpCommandProcessor.throwAssertionFailureExceptionOrError(HttpCommandProcessor.java:97)
	at com.thoughtworks.selenium.HttpCommandProcessor.doCommand(HttpCommandProcessor.java:91)
	at com.thoughtworks.selenium.DefaultSelenium.open(DefaultSelenium.java:335)
	at org.apache.continuum.web.test.parent.AbstractContinuumTest.goToProjectGroupsSummaryPage(AbstractContinuumTest.java:213)
	at org.apache.continuum.web.test.parent.AbstractContinuumTest.showProjectGroup(AbstractContinuumTest.java:242)
	at org.apache.continuum.web.test.parent.AbstractContinuumTest.showMembers(AbstractContinuumTest.java:838)
	at org.apache.continuum.web.test.ProjectGroupTest.testProjectGroupMembers(ProjectGroupTest.java:224)


    testMissingElementInPom :
  java.lang.AssertionError
  java.lang.AssertionError: 'link=Maven 1.x Project' isn't present. expected:<true>
but was:<false>
	at org.testng.Assert.fail(Assert.java:84)
	at org.testng.Assert.failNotEquals(Assert.java:438)
	at org.testng.Assert.assertTrue(Assert.java:32)
	at org.apache.continuum.web.test.parent.AbstractSeleniumTest.assertElementPresent(AbstractSeleniumTest.java:170)
	at org.apache.continuum.web.test.parent.AbstractSeleniumTest.clickLinkWithLocator(AbstractSeleniumTest.java:357)
	at org.apache.continuum.web.test.parent.AbstractSeleniumTest.clickLinkWithText(AbstractSeleniumTest.java:337)
	at org.apache.continuum.web.test.parent.AbstractSeleniumTest.clickLinkWithText(AbstractSeleniumTest.java:332)
	at org.apache.continuum.web.test.parent.AbstractContinuumTest.goToAddMavenOneProjectPage(AbstractContinuumTest.java:661)
	at org.apache.continuum.web.test.MavenOneProjectTest.testMissingElementInPom(MavenOneProjectTest.java:112)


    testDeleteSchedule :
  java.lang.AssertionError
  java.lang.AssertionError: expected:<Continuum - Schedules> but was:<Continuum -
Edit Schedule>
	at org.testng.Assert.fail(Assert.java:84)
	at org.testng.Assert.failNotEquals(Assert.java:438)
	at org.testng.Assert.assertEquals(Assert.java:108)
	at org.testng.Assert.assertEquals(Assert.java:129)
	at org.testng.Assert.assertEquals(Assert.java:139)
	at org.apache.continuum.web.test.parent.AbstractSeleniumTest.assertPage(AbstractSeleniumTest.java:145)
	at org.apache.continuum.web.test.parent.AbstractScheduleTest.assertSchedulePage(AbstractScheduleTest.java:45)
	at org.apache.continuum.web.test.parent.AbstractScheduleTest.removeSchedule(AbstractScheduleTest.java:173)
	at org.apache.continuum.web.test.ScheduleTest.testDeleteSchedule(ScheduleTest.java:142)

  



Mime
View raw message