continuum-notifications mailing list archives

Site index · List index
Message view « Date » · « Thread »
Top « Date » · « Thread »
From "Continuum@vmbuild.apache.org" <contin...@apache.org>
Subject [continuum] BUILD FAILURE: Continuum - Continuum :: Webapp Tests - Maven 2.0.9, Java 5
Date Fri, 15 Jan 2010 01:20:33 GMT
Online report : http://vmbuild.apache.org/continuum/buildResult.action?buildId=269892&projectId=2284

Build statistics:
  State: Failed
  Previous State: Failed
  Started at: Thu 14 Jan 2010 15:50:54 -0800
  Finished at: Thu 14 Jan 2010 17:20:12 -0800
  Total time: 1h 29m 18s
  Build Trigger: Schedule
  Build Number: 1
  Exit code: 1
  Building machine hostname: vmbuild.apache.org
  Operating system : Linux(unknown)
  Java Home version : 
          java version "1.5.0_12"
          Java(TM) 2 Runtime Environment, Standard Edition (build 1.5.0_12-b04)
          Java HotSpot(TM) Client VM (build 1.5.0_12-b04, mixed mode, sharing)
        
  Builder version :
          Maven version: 2.0.9
          Java version: 1.5.0_12
          OS name: "linux" version: "2.6.24-23-server" arch: "i386" Family: "unix"
    
****************************************************************************
SCM Changes:
****************************************************************************
No files changed

****************************************************************************
Dependencies Changes:
****************************************************************************
org.apache.continuum:continuum-webapp:1.4.0-SNAPSHOT

org.apache.continuum:continuum:1.4.0-SNAPSHOT


****************************************************************************
Build Definition:
****************************************************************************
POM filename: pom.xml
Goals: clean install   
Arguments: --batch-mode --non-recursive -U -P headless
Build Fresh: false
Always Build: false
Default Build Definition: true
Schedule: DEFAULT_SCHEDULE
Profile Name: Maven 2.0.9, Java 5
Description: Maven 2.0.9, Java 5

****************************************************************************
Test Summary:
****************************************************************************
Tests: 192
Failures: 4
Errors: 0
Success Rate: 97
Total time: 5009.437

****************************************************************************
Test Failures:
****************************************************************************

TestSuite
    initializeContinuum :
  com.thoughtworks.selenium.SeleniumException
  com.thoughtworks.selenium.SeleniumException: Timed out after 30000ms
	at com.thoughtworks.selenium.HttpCommandProcessor.throwAssertionFailureExceptionOrError(HttpCommandProcessor.java:97)
	at com.thoughtworks.selenium.HttpCommandProcessor.doCommand(HttpCommandProcessor.java:91)
	at com.thoughtworks.selenium.DefaultSelenium.open(DefaultSelenium.java:335)
	at org.apache.continuum.web.test.SetupSelenium.initializeContinuum(SetupSelenium.java:65)

    testAddInvalidBuildDefinitionTemplate :
  com.thoughtworks.selenium.SeleniumException
  com.thoughtworks.selenium.SeleniumException: Timed out after 60000ms
	at com.thoughtworks.selenium.HttpCommandProcessor.throwAssertionFailureExceptionOrError(HttpCommandProcessor.java:97)
	at com.thoughtworks.selenium.HttpCommandProcessor.doCommand(HttpCommandProcessor.java:91)
	at com.thoughtworks.selenium.DefaultSelenium.waitForPageToLoad(DefaultSelenium.java:635)
	at org.apache.continuum.web.test.parent.AbstractSeleniumTest.waitPage(AbstractSeleniumTest.java:224)
	at org.apache.continuum.web.test.parent.AbstractSeleniumTest.clickLinkWithLocator(AbstractSeleniumTest.java:356)
	at org.apache.continuum.web.test.parent.AbstractSeleniumTest.clickLinkWithText(AbstractSeleniumTest.java:332)
	at org.apache.continuum.web.test.parent.AbstractSeleniumTest.clickLinkWithText(AbstractSeleniumTest.java:327)
	at org.apache.continuum.web.test.parent.AbstractBuildDefinitionTemplateTest.goToBuildDefinitionTemplatePage(AbstractBuildDefinitionTemplateTest.java:31)
	at org.apache.continuum.web.test.parent.AbstractBuildDefinitionTemplateTest.goToAddBuildDefinitionTemplate(AbstractBuildDefinitionTemplateTest.java:131)
	at org.apache.continuum.web.test.BuildDefinitionTemplateTest.testAddInvalidBuildDefinitionTemplate(BuildDefinitionTemplateTest.java:88)


    testAddInvalidInstallationTool :
  java.lang.AssertionError
  java.lang.AssertionError: 'link=Installations' isn't present. expected:<true> but
was:<false>
	at org.testng.Assert.fail(Assert.java:84)
	at org.testng.Assert.failNotEquals(Assert.java:438)
	at org.testng.Assert.assertTrue(Assert.java:32)
	at org.apache.continuum.web.test.parent.AbstractSeleniumTest.assertElementPresent(AbstractSeleniumTest.java:170)
	at org.apache.continuum.web.test.parent.AbstractSeleniumTest.clickLinkWithLocator(AbstractSeleniumTest.java:352)
	at org.apache.continuum.web.test.parent.AbstractSeleniumTest.clickLinkWithText(AbstractSeleniumTest.java:332)
	at org.apache.continuum.web.test.parent.AbstractSeleniumTest.clickLinkWithText(AbstractSeleniumTest.java:327)
	at org.apache.continuum.web.test.parent.AbstractInstallationTest.goToInstallationPage(AbstractInstallationTest.java:31)
	at org.apache.continuum.web.test.parent.AbstractInstallationTest.goToAddInstallationTool(AbstractInstallationTest.java:44)
	at org.apache.continuum.web.test.InstallationTest.testAddInvalidInstallationTool(InstallationTest.java:71)

    testAddMavenTwoProjectWithNoDefaultBuildDefinitionInTemplate :
  com.thoughtworks.selenium.SeleniumException
  com.thoughtworks.selenium.SeleniumException: Timed out after 60000ms
	at com.thoughtworks.selenium.HttpCommandProcessor.throwAssertionFailureExceptionOrError(HttpCommandProcessor.java:97)
	at com.thoughtworks.selenium.HttpCommandProcessor.doCommand(HttpCommandProcessor.java:91)
	at com.thoughtworks.selenium.DefaultSelenium.waitForPageToLoad(DefaultSelenium.java:635)
	at org.apache.continuum.web.test.parent.AbstractSeleniumTest.waitPage(AbstractSeleniumTest.java:224)
	at org.apache.continuum.web.test.parent.AbstractSeleniumTest.clickLinkWithLocator(AbstractSeleniumTest.java:356)
	at org.apache.continuum.web.test.parent.AbstractSeleniumTest.clickLinkWithXPath(AbstractSeleniumTest.java:342)
	at org.apache.continuum.web.test.parent.AbstractContinuumTest.goToEditBuildDefinitionTemplate(AbstractContinuumTest.java:944)
	at org.apache.continuum.web.test.parent.AbstractContinuumTest.removeDefaultBuildDefinitionFromTemplate(AbstractContinuumTest.java:906)
	at org.apache.continuum.web.test.MavenTwoProjectTest.testAddMavenTwoProjectWithNoDefaultBuildDefinitionInTemplate(MavenTwoProjectTest.java:48)

  



Mime
View raw message