continuum-notifications mailing list archives

Site index · List index
Message view « Date » · « Thread »
Top « Date » · « Thread »
From "Continuum@vmbuild.apache.org" <contin...@apache.org>
Subject [continuum] BUILD FAILURE: Continuum - Continuum Webapp Test - Maven 2.0.9, Java 5
Date Mon, 11 Jan 2010 20:05:10 GMT
Online report : http://vmbuild.apache.org/continuum/buildResult.action?buildId=267988&projectId=2284

Build statistics:
  State: Failed
  Previous State: Building
  Started at: Mon 11 Jan 2010 10:36:50 -0800
  Finished at: Mon 11 Jan 2010 12:04:58 -0800
  Total time: 1h 28m 7s
  Build Trigger: Schedule
  Build Number: 1
  Exit code: 1
  Building machine hostname: vmbuild.apache.org
  Operating system : Linux(unknown)
  Java Home version : 
          java version "1.5.0_12"
          Java(TM) 2 Runtime Environment, Standard Edition (build 1.5.0_12-b04)
          Java HotSpot(TM) Client VM (build 1.5.0_12-b04, mixed mode, sharing)
        
  Builder version :
          Maven version: 2.0.9
          Java version: 1.5.0_12
          OS name: "linux" version: "2.6.24-23-server" arch: "i386" Family: "unix"
    
****************************************************************************
SCM Changes:
****************************************************************************
No files changed

****************************************************************************
Dependencies Changes:
****************************************************************************
org.apache.continuum:continuum-webapp:1.4.0-SNAPSHOT

org.apache.continuum:continuum:1.4.0-SNAPSHOT


****************************************************************************
Build Definition:
****************************************************************************
POM filename: pom.xml
Goals: clean install   
Arguments: --batch-mode --non-recursive -U -P headless
Build Fresh: false
Always Build: false
Default Build Definition: true
Schedule: DEFAULT_SCHEDULE
Profile Name: Maven 2.0.9, Java 5
Description: Maven 2.0.9, Java 5

****************************************************************************
Test Summary:
****************************************************************************
Tests: 192
Failures: 4
Errors: 0
Success Rate: 97
Total time: 5040.945

****************************************************************************
Test Failures:
****************************************************************************

TestSuite
    testAddShellProject :
  java.lang.AssertionError
  java.lang.AssertionError: expected:<true> but was:<false>
	at org.testng.Assert.fail(Assert.java:84)
	at org.testng.Assert.failNotEquals(Assert.java:438)
	at org.testng.Assert.assertTrue(Assert.java:32)
	at org.testng.Assert.assertTrue(Assert.java:42)
	at org.apache.continuum.web.test.parent.AbstractContinuumTest.waitAddProject(AbstractContinuumTest.java:805)
	at org.apache.continuum.web.test.parent.AbstractContinuumTest.addProject(AbstractContinuumTest.java:793)
	at org.apache.continuum.web.test.ShellProjectTest.testAddShellProject(ShellProjectTest.java:49)


    testDeleteMavenTwoProject :
  java.lang.AssertionError
  java.lang.AssertionError: 'link=Show Project Groups' isn't present. expected:<true>
but was:<false>
	at org.testng.Assert.fail(Assert.java:84)
	at org.testng.Assert.failNotEquals(Assert.java:438)
	at org.testng.Assert.assertTrue(Assert.java:32)
	at org.apache.continuum.web.test.parent.AbstractSeleniumTest.assertElementPresent(AbstractSeleniumTest.java:170)
	at org.apache.continuum.web.test.parent.AbstractSeleniumTest.clickLinkWithLocator(AbstractSeleniumTest.java:352)
	at org.apache.continuum.web.test.parent.AbstractSeleniumTest.clickLinkWithText(AbstractSeleniumTest.java:332)
	at org.apache.continuum.web.test.parent.AbstractSeleniumTest.clickLinkWithText(AbstractSeleniumTest.java:327)
	at org.apache.continuum.web.test.parent.AbstractContinuumTest.goToProjectGroupsSummaryPage(AbstractContinuumTest.java:211)
	at org.apache.continuum.web.test.MavenTwoProjectTest.addMaven2Project(MavenTwoProjectTest.java:257)
	at org.apache.continuum.web.test.MavenTwoProjectTest.testDeleteMavenTwoProject(MavenTwoProjectTest.java:206)

    testAddAntProject :
  java.lang.AssertionError
  java.lang.AssertionError: 'Test Project Group Name' isn't present. expected:<true>
but was:<false>
	at org.testng.Assert.fail(Assert.java:84)
	at org.testng.Assert.failNotEquals(Assert.java:438)
	at org.testng.Assert.assertTrue(Assert.java:32)
	at org.apache.continuum.web.test.parent.AbstractSeleniumTest.assertTextPresent(AbstractSeleniumTest.java:160)
	at org.apache.continuum.web.test.parent.AbstractContinuumTest.assertProjectGroupSummaryPage(AbstractContinuumTest.java:252)
	at org.apache.continuum.web.test.AntProjectTest.testAddAntProject(AntProjectTest.java:52)


    testAddUserWithSystemAdminRole :
  com.thoughtworks.selenium.SeleniumException
  com.thoughtworks.selenium.SeleniumException: Timed out after 60000ms
	at com.thoughtworks.selenium.HttpCommandProcessor.throwAssertionFailureExceptionOrError(HttpCommandProcessor.java:97)
	at com.thoughtworks.selenium.HttpCommandProcessor.doCommand(HttpCommandProcessor.java:91)
	at com.thoughtworks.selenium.DefaultSelenium.waitForPageToLoad(DefaultSelenium.java:635)
	at org.apache.continuum.web.test.parent.AbstractSeleniumTest.waitPage(AbstractSeleniumTest.java:224)
	at org.apache.continuum.web.test.parent.AbstractSeleniumTest.clickLinkWithLocator(AbstractSeleniumTest.java:356)
	at org.apache.continuum.web.test.parent.AbstractSeleniumTest.clickLinkWithText(AbstractSeleniumTest.java:332)
	at org.apache.continuum.web.test.parent.AbstractSeleniumTest.clickLinkWithText(AbstractSeleniumTest.java:327)
	at org.apache.continuum.web.test.parent.AbstractContinuumTest.goToLoginPage(AbstractContinuumTest.java:86)
	at org.apache.continuum.web.test.parent.AbstractUserRolesManagementTest.login(AbstractUserRolesManagementTest.java:314)
	at org.apache.continuum.web.test.parent.AbstractUserRolesManagementTest.login(AbstractUserRolesManagementTest.java:307)
	at org.apache.continuum.web.test.UserRolesManagementTest.testAddUserWithSystemAdminRole(UserRolesManagementTest.java:120)


  



Mime
View raw message