continuum-notifications mailing list archives

Site index · List index
Message view « Date » · « Thread »
Top « Date » · « Thread »
From "Continuum@vmbuild.apache.org" <contin...@apache.org>
Subject [continuum] BUILD FAILURE: Continuum - Continuum :: Webapp Tests - Maven 2.0.9, Java 5
Date Fri, 15 Jan 2010 10:00:07 GMT
Online report : http://vmbuild.apache.org/continuum/buildResult.action?buildId=270160&projectId=2284

Build statistics:
  State: Failed
  Previous State: Building
  Started at: Fri 15 Jan 2010 00:39:26 -0800
  Finished at: Fri 15 Jan 2010 01:59:52 -0800
  Total time: 1h 20m 26s
  Build Trigger: Schedule
  Build Number: 1
  Exit code: 1
  Building machine hostname: vmbuild.apache.org
  Operating system : Linux(unknown)
  Java Home version : 
          java version "1.5.0_12"
          Java(TM) 2 Runtime Environment, Standard Edition (build 1.5.0_12-b04)
          Java HotSpot(TM) Client VM (build 1.5.0_12-b04, mixed mode, sharing)
        
  Builder version :
          Maven version: 2.0.9
          Java version: 1.5.0_12
          OS name: "linux" version: "2.6.24-23-server" arch: "i386" Family: "unix"
    
****************************************************************************
SCM Changes:
****************************************************************************
Changed: ctan @ Mon 11 Jan 2010 18:25:34 -0800
Comment: [CONTINUUM-2411] do not throw exception when there is no default build definition
in the template. only log a warning saying that project cannot be checked out without a build
definition
merge -r 898152:898153 of 1.3.x branch
Files changed:
  /continuum/trunk/continuum-core/src/main/java/org/apache/maven/continuum/DefaultContinuum.java
( 898154 )
  /continuum/trunk/continuum-webapp-test/src/test/testng/org/apache/continuum/web/test/MavenOneProjectTest.java
( 898154 )
  /continuum/trunk/continuum-webapp-test/src/test/testng/org/apache/continuum/web/test/MavenTwoProjectTest.java
( 898154 )
  /continuum/trunk/continuum-webapp-test/src/test/testng/org/apache/continuum/web/test/parent/AbstractContinuumTest.java
( 898154 )
  /continuum/trunk/continuum-webapp-test/src/test/testng/org/apache/continuum/web/test/parent/AbstractSeleniumTest.java
( 898154 )

****************************************************************************
Dependencies Changes:
****************************************************************************
org.apache.continuum:continuum-webapp:1.4.0-SNAPSHOT

org.apache.continuum:continuum:1.4.0-SNAPSHOT


****************************************************************************
Build Definition:
****************************************************************************
POM filename: pom.xml
Goals: clean install   
Arguments: --batch-mode --non-recursive -U -P headless
Build Fresh: false
Always Build: false
Default Build Definition: true
Schedule: DEFAULT_SCHEDULE
Profile Name: Maven 2.0.9, Java 5
Description: Maven 2.0.9, Java 5

****************************************************************************
Test Summary:
****************************************************************************
Tests: 192
Failures: 6
Errors: 0
Success Rate: 96
Total time: 4618.265

****************************************************************************
Test Failures:
****************************************************************************

TestSuite
    initializeContinuum :
  com.thoughtworks.selenium.SeleniumException
  com.thoughtworks.selenium.SeleniumException: Timed out after 30000ms
	at com.thoughtworks.selenium.HttpCommandProcessor.throwAssertionFailureExceptionOrError(HttpCommandProcessor.java:97)
	at com.thoughtworks.selenium.HttpCommandProcessor.doCommand(HttpCommandProcessor.java:91)
	at com.thoughtworks.selenium.DefaultSelenium.open(DefaultSelenium.java:335)
	at org.apache.continuum.web.test.SetupSelenium.initializeContinuum(SetupSelenium.java:65)

    testAddInvalidGroupBuildDefinition :
  com.thoughtworks.selenium.SeleniumException
  com.thoughtworks.selenium.SeleniumException: Timed out after 30000ms
	at com.thoughtworks.selenium.HttpCommandProcessor.throwAssertionFailureExceptionOrError(HttpCommandProcessor.java:97)
	at com.thoughtworks.selenium.HttpCommandProcessor.doCommand(HttpCommandProcessor.java:91)
	at com.thoughtworks.selenium.DefaultSelenium.open(DefaultSelenium.java:335)
	at org.apache.continuum.web.test.parent.AbstractContinuumTest.goToProjectGroupsSummaryPage(AbstractContinuumTest.java:212)
	at org.apache.continuum.web.test.parent.AbstractContinuumTest.showProjectGroup(AbstractContinuumTest.java:241)
	at org.apache.continuum.web.test.parent.AbstractContinuumTest.goToGroupBuildDefinitionPage(AbstractContinuumTest.java:422)
	at org.apache.continuum.web.test.BuildDefinitionTest.testAddInvalidGroupBuildDefinition(BuildDefinitionTest.java:76)

    testAddMavenTwoProject :
  com.thoughtworks.selenium.SeleniumException
  com.thoughtworks.selenium.SeleniumException: ERROR: Couldn't access document.body.  Is this
HTML page fully loaded?
	at com.thoughtworks.selenium.HttpCommandProcessor.throwAssertionFailureExceptionOrError(HttpCommandProcessor.java:97)
	at com.thoughtworks.selenium.HttpCommandProcessor.doCommand(HttpCommandProcessor.java:91)
	at com.thoughtworks.selenium.HttpCommandProcessor.getString(HttpCommandProcessor.java:262)
	at com.thoughtworks.selenium.HttpCommandProcessor.getBoolean(HttpCommandProcessor.java:335)
	at com.thoughtworks.selenium.DefaultSelenium.isTextPresent(DefaultSelenium.java:499)
	at org.apache.continuum.web.test.parent.AbstractSeleniumTest.isTextPresent(AbstractSeleniumTest.java:209)
	at org.apache.continuum.web.test.parent.AbstractContinuumTest.assertProjectGroupSummaryPage(AbstractContinuumTest.java:269)
	at org.apache.continuum.web.test.MavenTwoProjectTest.testAddMavenTwoProject(MavenTwoProjectTest.java:79)

    testEditValidIrcProjectNotifier :
  com.thoughtworks.selenium.SeleniumException
  com.thoughtworks.selenium.SeleniumException: Timed out after 60000ms
	at com.thoughtworks.selenium.HttpCommandProcessor.throwAssertionFailureExceptionOrError(HttpCommandProcessor.java:97)
	at com.thoughtworks.selenium.HttpCommandProcessor.doCommand(HttpCommandProcessor.java:91)
	at com.thoughtworks.selenium.DefaultSelenium.waitForPageToLoad(DefaultSelenium.java:635)
	at org.apache.continuum.web.test.parent.AbstractSeleniumTest.waitPage(AbstractSeleniumTest.java:224)
	at org.apache.continuum.web.test.parent.AbstractSeleniumTest.clickLinkWithLocator(AbstractSeleniumTest.java:356)
	at org.apache.continuum.web.test.parent.AbstractSeleniumTest.clickLinkWithText(AbstractSeleniumTest.java:332)
	at org.apache.continuum.web.test.parent.AbstractSeleniumTest.clickLinkWithText(AbstractSeleniumTest.java:327)
	at org.apache.continuum.web.test.parent.AbstractContinuumTest.goToProjectInformationPage(AbstractContinuumTest.java:549)
	at org.apache.continuum.web.test.NotifierTest.testEditValidIrcProjectNotifier(NotifierTest.java:148)

    testAddInstallationVariableWithoutBuildEnvirotment :
  java.lang.AssertionError
  java.lang.AssertionError: 'link=Installations' isn't present. expected:<true> but
was:<false>
	at org.testng.Assert.fail(Assert.java:84)
	at org.testng.Assert.failNotEquals(Assert.java:438)
	at org.testng.Assert.assertTrue(Assert.java:32)
	at org.apache.continuum.web.test.parent.AbstractSeleniumTest.assertElementPresent(AbstractSeleniumTest.java:170)
	at org.apache.continuum.web.test.parent.AbstractSeleniumTest.clickLinkWithLocator(AbstractSeleniumTest.java:352)
	at org.apache.continuum.web.test.parent.AbstractSeleniumTest.clickLinkWithText(AbstractSeleniumTest.java:332)
	at org.apache.continuum.web.test.parent.AbstractSeleniumTest.clickLinkWithText(AbstractSeleniumTest.java:327)
	at org.apache.continuum.web.test.parent.AbstractInstallationTest.goToInstallationPage(AbstractInstallationTest.java:31)
	at org.apache.continuum.web.test.parent.AbstractInstallationTest.goToAddInstallationVariable(AbstractInstallationTest.java:54)
	at org.apache.continuum.web.test.InstallationTest.testAddInstallationVariableWithoutBuildEnvirotment(InstallationTest.java:65)

    testDeleteMavenOneProject :
  com.thoughtworks.selenium.SeleniumException
  com.thoughtworks.selenium.SeleniumException: Timed out after 30000ms
	at com.thoughtworks.selenium.HttpCommandProcessor.throwAssertionFailureExceptionOrError(HttpCommandProcessor.java:97)
	at com.thoughtworks.selenium.HttpCommandProcessor.doCommand(HttpCommandProcessor.java:91)
	at com.thoughtworks.selenium.DefaultSelenium.open(DefaultSelenium.java:335)
	at org.apache.continuum.web.test.parent.AbstractContinuumTest.goToProjectGroupsSummaryPage(AbstractContinuumTest.java:212)
	at org.apache.continuum.web.test.MavenOneProjectTest.addMaven1Project(MavenOneProjectTest.java:236)
	at org.apache.continuum.web.test.MavenOneProjectTest.testDeleteMavenOneProject(MavenOneProjectTest.java:209)


  



Mime
View raw message