continuum-notifications mailing list archives

Site index · List index
Message view « Date » · « Thread »
Top « Date » · « Thread »
From "Continuum@vmbuild.apache.org" <contin...@apache.org>
Subject [continuum] BUILD FAILURE: Continuum - Continuum Webapp Test - Maven 2.0.9, Java 5
Date Tue, 12 Jan 2010 04:25:08 GMT
Online report : http://vmbuild.apache.org/continuum/buildResult.action?buildId=268174&projectId=2284

Build statistics:
  State: Failed
  Previous State: Failed
  Started at: Mon 11 Jan 2010 19:07:45 -0800
  Finished at: Mon 11 Jan 2010 20:24:40 -0800
  Total time: 1h 16m 54s
  Build Trigger: Schedule
  Build Number: 1
  Exit code: 1
  Building machine hostname: vmbuild.apache.org
  Operating system : Linux(unknown)
  Java Home version : 
          java version "1.5.0_12"
          Java(TM) 2 Runtime Environment, Standard Edition (build 1.5.0_12-b04)
          Java HotSpot(TM) Client VM (build 1.5.0_12-b04, mixed mode, sharing)
        
  Builder version :
          Maven version: 2.0.9
          Java version: 1.5.0_12
          OS name: "linux" version: "2.6.24-23-server" arch: "i386" Family: "unix"
    
****************************************************************************
SCM Changes:
****************************************************************************
Changed: ctan @ Mon 11 Jan 2010 18:25:34 -0800
Comment: [CONTINUUM-2411] do not throw exception when there is no default build definition
in the template. only log a warning saying that project cannot be checked out without a build
definition
merge -r 898152:898153 of 1.3.x branch
Files changed:
  /continuum/trunk/continuum-core/src/main/java/org/apache/maven/continuum/DefaultContinuum.java
( 898154 )
  /continuum/trunk/continuum-webapp-test/src/test/testng/org/apache/continuum/web/test/MavenOneProjectTest.java
( 898154 )
  /continuum/trunk/continuum-webapp-test/src/test/testng/org/apache/continuum/web/test/MavenTwoProjectTest.java
( 898154 )
  /continuum/trunk/continuum-webapp-test/src/test/testng/org/apache/continuum/web/test/parent/AbstractContinuumTest.java
( 898154 )
  /continuum/trunk/continuum-webapp-test/src/test/testng/org/apache/continuum/web/test/parent/AbstractSeleniumTest.java
( 898154 )

****************************************************************************
Dependencies Changes:
****************************************************************************
No dependencies changed


****************************************************************************
Build Definition:
****************************************************************************
POM filename: pom.xml
Goals: clean install   
Arguments: --batch-mode --non-recursive -U -P headless
Build Fresh: false
Always Build: false
Default Build Definition: true
Schedule: DEFAULT_SCHEDULE
Profile Name: Maven 2.0.9, Java 5
Description: Maven 2.0.9, Java 5

****************************************************************************
Test Summary:
****************************************************************************
Tests: 196
Failures: 11
Errors: 0
Success Rate: 94
Total time: 4099.87

****************************************************************************
Test Failures:
****************************************************************************

TestSuite
    initializeContinuum :
  com.thoughtworks.selenium.SeleniumException
  com.thoughtworks.selenium.SeleniumException: Timed out after 30000ms
	at com.thoughtworks.selenium.HttpCommandProcessor.throwAssertionFailureExceptionOrError(HttpCommandProcessor.java:97)
	at com.thoughtworks.selenium.HttpCommandProcessor.doCommand(HttpCommandProcessor.java:91)
	at com.thoughtworks.selenium.DefaultSelenium.open(DefaultSelenium.java:335)
	at org.apache.continuum.web.test.SetupSelenium.initializeContinuum(SetupSelenium.java:65)

    testAddShellProject :
  java.lang.AssertionError
  java.lang.AssertionError: expected:<true> but was:<false>
	at org.testng.Assert.fail(Assert.java:84)
	at org.testng.Assert.failNotEquals(Assert.java:438)
	at org.testng.Assert.assertTrue(Assert.java:32)
	at org.testng.Assert.assertTrue(Assert.java:42)
	at org.apache.continuum.web.test.parent.AbstractContinuumTest.waitAddProject(AbstractContinuumTest.java:805)
	at org.apache.continuum.web.test.parent.AbstractContinuumTest.addProject(AbstractContinuumTest.java:793)
	at org.apache.continuum.web.test.ShellProjectTest.testAddShellProject(ShellProjectTest.java:49)


    testAddMavenTwoProjectWithNoDefaultBuildDefinitionInTemplate :
  java.lang.AssertionError
  java.lang.AssertionError: expected:<true> but was:<false>
	at org.testng.Assert.fail(Assert.java:84)
	at org.testng.Assert.failNotEquals(Assert.java:438)
	at org.testng.Assert.assertTrue(Assert.java:32)
	at org.testng.Assert.assertTrue(Assert.java:42)
	at org.apache.continuum.web.test.parent.AbstractContinuumTest.waitAddProject(AbstractContinuumTest.java:805)
	at org.apache.continuum.web.test.parent.AbstractContinuumTest.addMavenTwoProject(AbstractContinuumTest.java:628)
	at org.apache.continuum.web.test.MavenTwoProjectTest.testAddMavenTwoProjectWithNoDefaultBuildDefinitionInTemplate(MavenTwoProjectTest.java:50)


    testMissingElementInPom :
  com.thoughtworks.selenium.SeleniumException
  com.thoughtworks.selenium.SeleniumException: ERROR: Couldn't access document.body.  Is this
HTML page fully loaded?
	at com.thoughtworks.selenium.HttpCommandProcessor.throwAssertionFailureExceptionOrError(HttpCommandProcessor.java:97)
	at com.thoughtworks.selenium.HttpCommandProcessor.doCommand(HttpCommandProcessor.java:91)
	at com.thoughtworks.selenium.HttpCommandProcessor.getString(HttpCommandProcessor.java:262)
	at com.thoughtworks.selenium.HttpCommandProcessor.getBoolean(HttpCommandProcessor.java:335)
	at com.thoughtworks.selenium.DefaultSelenium.isTextPresent(DefaultSelenium.java:499)
	at org.apache.continuum.web.test.parent.AbstractSeleniumTest.assertTextPresent(AbstractSeleniumTest.java:160)
	at org.apache.continuum.web.test.MavenOneProjectTest.testMissingElementInPom(MavenOneProjectTest.java:114)

    testAddAntProject :
  java.lang.AssertionError
  java.lang.AssertionError: 'Test Project Group Name' isn't present. expected:<true>
but was:<false>
	at org.testng.Assert.fail(Assert.java:84)
	at org.testng.Assert.failNotEquals(Assert.java:438)
	at org.testng.Assert.assertTrue(Assert.java:32)
	at org.apache.continuum.web.test.parent.AbstractSeleniumTest.assertTextPresent(AbstractSeleniumTest.java:160)
	at org.apache.continuum.web.test.parent.AbstractContinuumTest.assertProjectGroupSummaryPage(AbstractContinuumTest.java:252)
	at org.apache.continuum.web.test.AntProjectTest.testAddAntProject(AntProjectTest.java:52)

    testAddMavenOneProjectWithNoDefaultBuildDefinitionFromTemplate :
  java.lang.AssertionError
  java.lang.AssertionError: expected:<true> but was:<false>
	at org.testng.Assert.fail(Assert.java:84)
	at org.testng.Assert.failNotEquals(Assert.java:438)
	at org.testng.Assert.assertTrue(Assert.java:32)
	at org.testng.Assert.assertTrue(Assert.java:42)
	at org.apache.continuum.web.test.parent.AbstractContinuumTest.waitAddProject(AbstractContinuumTest.java:805)
	at org.apache.continuum.web.test.parent.AbstractContinuumTest.addMavenOneProject(AbstractContinuumTest.java:707)
	at org.apache.continuum.web.test.MavenOneProjectTest.testAddMavenOneProjectWithNoDefaultBuildDefinitionFromTemplate(MavenOneProjectTest.java:48)


    testAddMavenTwoProjectModuleNameWithSameLetter :
  java.lang.AssertionError
  java.lang.AssertionError: expected:<true> but was:<false>
	at org.testng.Assert.fail(Assert.java:84)
	at org.testng.Assert.failNotEquals(Assert.java:438)
	at org.testng.Assert.assertTrue(Assert.java:32)
	at org.testng.Assert.assertTrue(Assert.java:42)
	at org.apache.continuum.web.test.parent.AbstractContinuumTest.waitAddProject(AbstractContinuumTest.java:805)
	at org.apache.continuum.web.test.parent.AbstractContinuumTest.addMavenTwoProject(AbstractContinuumTest.java:628)
	at org.apache.continuum.web.test.MavenTwoProjectTest.testAddMavenTwoProjectModuleNameWithSameLetter(MavenTwoProjectTest.java:100)


    testDeleteSchedule :
  java.lang.AssertionError
  java.lang.AssertionError: expected:<Continuum - Schedules> but was:<Continuum -
Edit Schedule>
	at org.testng.Assert.fail(Assert.java:84)
	at org.testng.Assert.failNotEquals(Assert.java:438)
	at org.testng.Assert.assertEquals(Assert.java:108)
	at org.testng.Assert.assertEquals(Assert.java:129)
	at org.testng.Assert.assertEquals(Assert.java:139)
	at org.apache.continuum.web.test.parent.AbstractSeleniumTest.assertPage(AbstractSeleniumTest.java:145)
	at org.apache.continuum.web.test.parent.AbstractScheduleTest.assertSchedulePage(AbstractScheduleTest.java:45)
	at org.apache.continuum.web.test.parent.AbstractScheduleTest.removeSchedule(AbstractScheduleTest.java:173)
	at org.apache.continuum.web.test.ScheduleTest.testDeleteSchedule(ScheduleTest.java:142)


    testAddEmptyBuildAgent :
  com.thoughtworks.selenium.SeleniumException
  com.thoughtworks.selenium.SeleniumException: Timed out after 60000ms
	at com.thoughtworks.selenium.HttpCommandProcessor.throwAssertionFailureExceptionOrError(HttpCommandProcessor.java:97)
	at com.thoughtworks.selenium.HttpCommandProcessor.doCommand(HttpCommandProcessor.java:91)
	at com.thoughtworks.selenium.DefaultSelenium.waitForPageToLoad(DefaultSelenium.java:635)
	at org.apache.continuum.web.test.parent.AbstractSeleniumTest.waitPage(AbstractSeleniumTest.java:224)
	at org.apache.continuum.web.test.parent.AbstractSeleniumTest.clickLinkWithLocator(AbstractSeleniumTest.java:356)
	at org.apache.continuum.web.test.parent.AbstractSeleniumTest.clickLinkWithText(AbstractSeleniumTest.java:332)
	at org.apache.continuum.web.test.parent.AbstractSeleniumTest.clickLinkWithText(AbstractSeleniumTest.java:327)
	at org.apache.continuum.web.test.parent.AbstractConfigurationTest.goToConfigurationPage(AbstractConfigurationTest.java:31)
	at org.apache.continuum.web.test.parent.AbstractBuildAgentsTest.enableDistributedBuilds(AbstractBuildAgentsTest.java:31)
	at org.apache.continuum.web.test.BuildAgentsTest.testAddEmptyBuildAgent(BuildAgentsTest.java:97)


    testEditBuildAgentGroup :
  com.thoughtworks.selenium.SeleniumException
  com.thoughtworks.selenium.SeleniumException: Timed out after 60000ms
	at com.thoughtworks.selenium.HttpCommandProcessor.throwAssertionFailureExceptionOrError(HttpCommandProcessor.java:97)
	at com.thoughtworks.selenium.HttpCommandProcessor.doCommand(HttpCommandProcessor.java:91)
	at com.thoughtworks.selenium.DefaultSelenium.waitForPageToLoad(DefaultSelenium.java:635)
	at org.apache.continuum.web.test.parent.AbstractSeleniumTest.waitPage(AbstractSeleniumTest.java:224)
	at org.apache.continuum.web.test.parent.AbstractSeleniumTest.clickLinkWithLocator(AbstractSeleniumTest.java:356)
	at org.apache.continuum.web.test.parent.AbstractSeleniumTest.clickLinkWithXPath(AbstractSeleniumTest.java:342)
	at org.apache.continuum.web.test.parent.AbstractSeleniumTest.clickLinkWithXPath(AbstractSeleniumTest.java:337)
	at org.apache.continuum.web.test.parent.AbstractBuildAgentsTest.goToEditBuildAgentGroup(AbstractBuildAgentsTest.java:212)
	at org.apache.continuum.web.test.BuildAgentsTest.testEditBuildAgentGroup(BuildAgentsTest.java:127)

    testBasicAddDeleteUser :
  com.thoughtworks.selenium.SeleniumException
  com.thoughtworks.selenium.SeleniumException: Timed out after 60000ms
	at com.thoughtworks.selenium.HttpCommandProcessor.throwAssertionFailureExceptionOrError(HttpCommandProcessor.java:97)
	at com.thoughtworks.selenium.HttpCommandProcessor.doCommand(HttpCommandProcessor.java:91)
	at com.thoughtworks.selenium.DefaultSelenium.waitForPageToLoad(DefaultSelenium.java:635)
	at org.apache.continuum.web.test.parent.AbstractSeleniumTest.waitPage(AbstractSeleniumTest.java:224)
	at org.apache.continuum.web.test.parent.AbstractSeleniumTest.clickLinkWithLocator(AbstractSeleniumTest.java:356)
	at org.apache.continuum.web.test.parent.AbstractSeleniumTest.clickLinkWithXPath(AbstractSeleniumTest.java:342)
	at org.apache.continuum.web.test.parent.AbstractSeleniumTest.clickLinkWithXPath(AbstractSeleniumTest.java:337)
	at org.apache.continuum.web.test.parent.AbstractSeleniumTest.submit(AbstractSeleniumTest.java:262)
	at org.apache.continuum.web.test.parent.AbstractUserRolesManagementTest.deleteUser(AbstractUserRolesManagementTest.java:372)
	at org.apache.continuum.web.test.parent.AbstractUserRolesManagementTest.deleteUser(AbstractUserRolesManagementTest.java:364)
	at org.apache.continuum.web.test.UserRolesManagementTest.testBasicAddDeleteUser(UserRolesManagementTest.java:16)

  



Mime
View raw message