continuum-notifications mailing list archives

Site index · List index
Message view « Date » · « Thread »
Top « Date » · « Thread »
From "Continuum@vmbuild.apache.org" <contin...@apache.org>
Subject [continuum] BUILD FAILURE: Continuum - Continuum :: Webapp Tests - Maven 2.0.9, Java 5
Date Wed, 13 Jan 2010 03:39:24 GMT
Online report : http://vmbuild.apache.org/continuum/buildResult.action?buildId=268731&projectId=2284

Build statistics:
  State: Failed
  Previous State: Failed
  Started at: Tue 12 Jan 2010 18:26:20 -0800
  Finished at: Tue 12 Jan 2010 19:39:11 -0800
  Total time: 1h 12m 51s
  Build Trigger: Schedule
  Build Number: 1
  Exit code: 1
  Building machine hostname: vmbuild.apache.org
  Operating system : Linux(unknown)
  Java Home version : 
          java version "1.5.0_12"
          Java(TM) 2 Runtime Environment, Standard Edition (build 1.5.0_12-b04)
          Java HotSpot(TM) Client VM (build 1.5.0_12-b04, mixed mode, sharing)
        
  Builder version :
          Maven version: 2.0.9
          Java version: 1.5.0_12
          OS name: "linux" version: "2.6.24-23-server" arch: "i386" Family: "unix"
    
****************************************************************************
SCM Changes:
****************************************************************************
No files changed

****************************************************************************
Dependencies Changes:
****************************************************************************
org.apache.continuum:continuum-webapp:1.4.0-SNAPSHOT

org.apache.continuum:continuum:1.4.0-SNAPSHOT


****************************************************************************
Build Definition:
****************************************************************************
POM filename: pom.xml
Goals: clean install   
Arguments: --batch-mode --non-recursive -U -P headless
Build Fresh: false
Always Build: false
Default Build Definition: true
Schedule: DEFAULT_SCHEDULE
Profile Name: Maven 2.0.9, Java 5
Description: Maven 2.0.9, Java 5

****************************************************************************
Test Summary:
****************************************************************************
Tests: 194
Failures: 6
Errors: 0
Success Rate: 96
Total time: 4032.57

****************************************************************************
Test Failures:
****************************************************************************

TestSuite
    testAddShellProject :
  java.lang.AssertionError
  java.lang.AssertionError: expected:<true> but was:<false>
	at org.testng.Assert.fail(Assert.java:84)
	at org.testng.Assert.failNotEquals(Assert.java:438)
	at org.testng.Assert.assertTrue(Assert.java:32)
	at org.testng.Assert.assertTrue(Assert.java:42)
	at org.apache.continuum.web.test.parent.AbstractContinuumTest.waitAddProject(AbstractContinuumTest.java:805)
	at org.apache.continuum.web.test.parent.AbstractContinuumTest.addProject(AbstractContinuumTest.java:793)
	at org.apache.continuum.web.test.ShellProjectTest.testAddShellProject(ShellProjectTest.java:49)


    testAddMavenTwoProjectFromRemoteSourceToNonDefaultProjectGroup :
  com.thoughtworks.selenium.SeleniumException
  com.thoughtworks.selenium.SeleniumException: ERROR: Couldn't access document.body.  Is this
HTML page fully loaded?
	at com.thoughtworks.selenium.HttpCommandProcessor.throwAssertionFailureExceptionOrError(HttpCommandProcessor.java:97)
	at com.thoughtworks.selenium.HttpCommandProcessor.doCommand(HttpCommandProcessor.java:91)
	at com.thoughtworks.selenium.HttpCommandProcessor.getString(HttpCommandProcessor.java:262)
	at com.thoughtworks.selenium.HttpCommandProcessor.getBoolean(HttpCommandProcessor.java:335)
	at com.thoughtworks.selenium.DefaultSelenium.isTextPresent(DefaultSelenium.java:499)
	at org.apache.continuum.web.test.parent.AbstractSeleniumTest.assertTextPresent(AbstractSeleniumTest.java:160)
	at org.apache.continuum.web.test.parent.AbstractContinuumTest.assertProjectGroupSummaryPage(AbstractContinuumTest.java:251)
	at org.apache.continuum.web.test.MavenTwoProjectTest.testAddMavenTwoProjectFromRemoteSourceToNonDefaultProjectGroup(MavenTwoProjectTest.java:122)


    testAddMavenTwoProject :
  com.thoughtworks.selenium.SeleniumException
  com.thoughtworks.selenium.SeleniumException: ERROR: Couldn't access document.body.  Is this
HTML page fully loaded?
	at com.thoughtworks.selenium.HttpCommandProcessor.throwAssertionFailureExceptionOrError(HttpCommandProcessor.java:97)
	at com.thoughtworks.selenium.HttpCommandProcessor.doCommand(HttpCommandProcessor.java:91)
	at com.thoughtworks.selenium.HttpCommandProcessor.getString(HttpCommandProcessor.java:262)
	at com.thoughtworks.selenium.HttpCommandProcessor.getBoolean(HttpCommandProcessor.java:335)
	at com.thoughtworks.selenium.DefaultSelenium.isTextPresent(DefaultSelenium.java:499)
	at org.apache.continuum.web.test.parent.AbstractSeleniumTest.assertTextPresent(AbstractSeleniumTest.java:160)
	at org.apache.continuum.web.test.parent.AbstractContinuumTest.assertProjectGroupSummaryPage(AbstractContinuumTest.java:251)
	at org.apache.continuum.web.test.MavenTwoProjectTest.testAddMavenTwoProject(MavenTwoProjectTest.java:79)


    testAddAntProject :
  java.lang.AssertionError
  java.lang.AssertionError: 'Test Project Group Name' isn't present. expected:<true>
but was:<false>
	at org.testng.Assert.fail(Assert.java:84)
	at org.testng.Assert.failNotEquals(Assert.java:438)
	at org.testng.Assert.assertTrue(Assert.java:32)
	at org.apache.continuum.web.test.parent.AbstractSeleniumTest.assertTextPresent(AbstractSeleniumTest.java:160)
	at org.apache.continuum.web.test.parent.AbstractContinuumTest.assertProjectGroupSummaryPage(AbstractContinuumTest.java:252)
	at org.apache.continuum.web.test.AntProjectTest.testAddAntProject(AntProjectTest.java:52)

    testAddMavenTwoProjectModuleNameWithSameLetter :
  java.lang.AssertionError
  java.lang.AssertionError: 'Group Actions' isn't present. expected:<true> but was:<false>
	at org.testng.Assert.fail(Assert.java:84)
	at org.testng.Assert.failNotEquals(Assert.java:438)
	at org.testng.Assert.assertTrue(Assert.java:32)
	at org.apache.continuum.web.test.parent.AbstractSeleniumTest.assertTextPresent(AbstractSeleniumTest.java:160)
	at org.apache.continuum.web.test.parent.AbstractContinuumTest.assertProjectGroupSummaryPage(AbstractContinuumTest.java:259)
	at org.apache.continuum.web.test.MavenTwoProjectTest.testAddMavenTwoProjectModuleNameWithSameLetter(MavenTwoProjectTest.java:102)

    testDeleteSchedule :
  java.lang.AssertionError
  java.lang.AssertionError: expected:<Continuum - Schedules> but was:<Continuum -
Edit Schedule>
	at org.testng.Assert.fail(Assert.java:84)
	at org.testng.Assert.failNotEquals(Assert.java:438)
	at org.testng.Assert.assertEquals(Assert.java:108)
	at org.testng.Assert.assertEquals(Assert.java:129)
	at org.testng.Assert.assertEquals(Assert.java:139)
	at org.apache.continuum.web.test.parent.AbstractSeleniumTest.assertPage(AbstractSeleniumTest.java:145)
	at org.apache.continuum.web.test.parent.AbstractScheduleTest.assertSchedulePage(AbstractScheduleTest.java:45)
	at org.apache.continuum.web.test.parent.AbstractScheduleTest.removeSchedule(AbstractScheduleTest.java:173)
	at org.apache.continuum.web.test.ScheduleTest.testDeleteSchedule(ScheduleTest.java:142)


  



Mime
View raw message