continuum-notifications mailing list archives

Site index · List index
Message view « Date » · « Thread »
Top « Date » · « Thread »
From "Continuum@vmbuild.apache.org" <contin...@apache.org>
Subject [continuum] BUILD FAILURE: Continuum - Continuum :: Webapp Tests - Maven 2.0.9, Java 5
Date Mon, 18 Jan 2010 09:50:32 GMT
Online report : http://vmbuild.apache.org/continuum/buildResult.action?buildId=271901&projectId=2284

Build statistics:
  State: Failed
  Previous State: Failed
  Started at: Mon 18 Jan 2010 00:28:36 -0800
  Finished at: Mon 18 Jan 2010 01:50:21 -0800
  Total time: 1h 21m 45s
  Build Trigger: Schedule
  Build Number: 1
  Exit code: 1
  Building machine hostname: vmbuild.apache.org
  Operating system : Linux(unknown)
  Java Home version : 
          java version "1.5.0_12"
          Java(TM) 2 Runtime Environment, Standard Edition (build 1.5.0_12-b04)
          Java HotSpot(TM) Client VM (build 1.5.0_12-b04, mixed mode, sharing)
        
  Builder version :
          Maven version: 2.0.9
          Java version: 1.5.0_12
          OS name: "linux" version: "2.6.24-23-server" arch: "i386" Family: "unix"
    
****************************************************************************
SCM Changes:
****************************************************************************
Changed: brett @ Sun 17 Jan 2010 19:50:27 -0800
Comment: merge recent changes from 1.3.x branch
Files changed:
  /continuum/trunk ( 900276 )
  /continuum/trunk/continuum-api/src/main/java/org/apache/continuum/taskqueue/BuildProjectTask.java
( 900276 )
  /continuum/trunk/continuum-api/src/main/java/org/apache/continuum/taskqueue/CheckOutTask.java
( 900276 )
  /continuum/trunk/continuum-api/src/main/java/org/apache/continuum/taskqueue/PrepareBuildProjectsTask.java
( 900276 )
  /continuum/trunk/continuum-buildagent/continuum-buildagent-core/src/main/java/org/apache/continuum/buildagent/build/execution/manager/BuildAgentBuildExecutorManager.java
( 900276 )
  /continuum/trunk/continuum-buildagent/continuum-buildagent-core/src/main/java/org/apache/continuum/buildagent/build/execution/manager/DefaultBuildAgentBuildExecutorManager.java
( 900276 )
  /continuum/trunk/continuum-buildagent/continuum-buildagent-core/src/main/java/org/apache/continuum/buildagent/build/execution/maven/m1
( 900276 )
  /continuum/trunk/continuum-buildagent/continuum-buildagent-core/src/main/java/org/apache/continuum/buildagent/build/execution/maven/m2/BuildAgentMavenBuilderHelper.java
( 900276 )
  /continuum/trunk/continuum-buildagent/continuum-buildagent-core/src/main/java/org/apache/continuum/buildagent/build/execution/maven/m2/DefaultBuildAgentMavenBuilderHelper.java
( 900276 )
  /continuum/trunk/continuum-buildagent/continuum-buildagent-core/src/main/java/org/apache/continuum/buildagent/configuration/BuildAgentConfiguration.java
( 900276 )
  /continuum/trunk/continuum-buildagent/continuum-buildagent-core/src/main/java/org/apache/continuum/buildagent/configuration/BuildAgentConfigurationException.java
( 900276 )
  /continuum/trunk/continuum-buildagent/continuum-buildagent-core/src/main/java/org/apache/continuum/buildagent/configuration/BuildAgentConfigurationService.java
( 900276 )
  /continuum/trunk/continuum-buildagent/continuum-buildagent-core/src/main/java/org/apache/continuum/buildagent/configuration/DefaultBuildAgentConfiguration.java
( 900276 )
  /continuum/trunk/continuum-buildagent/continuum-buildagent-core/src/main/java/org/apache/continuum/buildagent/configuration/DefaultBuildAgentConfigurationService.java
( 900276 )
  /continuum/trunk/continuum-buildagent/continuum-buildagent-core/src/main/java/org/apache/continuum/buildagent/configuration/GeneralBuildAgentConfiguration.java
( 900276 )
  /continuum/trunk/continuum-buildagent/continuum-buildagent-core/src/main/java/org/apache/continuum/buildagent/installation/BuildAgentInstallationService.java
( 900276 )
  /continuum/trunk/continuum-buildagent/continuum-buildagent-core/src/main/java/org/apache/continuum/buildagent/installation/DefaultBuildAgentInstallationService.java
( 900276 )
  /continuum/trunk/continuum-buildagent/continuum-buildagent-core/src/main/java/org/apache/continuum/buildagent/manager/BuildAgentManager.java
( 900276 )
  /continuum/trunk/continuum-buildagent/continuum-buildagent-core/src/main/java/org/apache/continuum/buildagent/manager/DefaultBuildAgentManager.java
( 900276 )
  /continuum/trunk/continuum-buildagent/continuum-buildagent-core/src/main/java/org/apache/continuum/buildagent/taskqueue/manager/BuildAgentTaskQueueManager.java
( 900276 )
  /continuum/trunk/continuum-buildagent/continuum-buildagent-core/src/main/java/org/apache/continuum/buildagent/taskqueue/manager/DefaultBuildAgentTaskQueueManager.java
( 900276 )
  /continuum/trunk/continuum-builder/src/main/java/org/apache/continuum/builder/distributed/executor/DistributedBuildProjectTaskExecutor.java
( 900276 )
  /continuum/trunk/continuum-builder/src/main/java/org/apache/continuum/builder/distributed/executor/ThreadedDistributedBuildTaskQueueExecutor.java
( 900276 )
  /continuum/trunk/continuum-data-management/data-management-cli ( 900276 )
  /continuum/trunk/continuum-docs/src/site/apt/user_guides/release/release_results.apt ( 900276
)
  /continuum/trunk/continuum-docs/src/site/xdoc ( 900276 )
  /continuum/trunk/continuum-model/src/main/resources/package-default.orm ( 900276 )
  /continuum/trunk/continuum-webapp/pom.xml ( 900276 )
  /continuum/trunk/continuum-webapp/src/main/java/org/apache/continuum/web/action/admin/BuildAgentAction.java
( 900276 )
  /continuum/trunk/continuum-webapp/src/main/webapp/WEB-INF/jsp/admin/confirmDeleteBuildAgent.jsp
( 900276 )
  /continuum/trunk/continuum-webapp-test/src/test/selenium-ide ( 900276 )
  /continuum/trunk/continuum-webapp-test/src/test/testng/org/apache/continuum/web/test/listener/CaptureScreenShotsListener.java
( 900276 )
  /continuum/trunk/src/site ( 900276 )

****************************************************************************
Dependencies Changes:
****************************************************************************
org.apache.continuum:continuum-webapp:1.4.0-SNAPSHOT


****************************************************************************
Build Definition:
****************************************************************************
POM filename: pom.xml
Goals: clean install   
Arguments: --batch-mode --non-recursive -U -P headless
Build Fresh: false
Always Build: false
Default Build Definition: true
Schedule: DEFAULT_SCHEDULE
Profile Name: Maven 2.0.9, Java 5
Description: Maven 2.0.9, Java 5

****************************************************************************
Test Summary:
****************************************************************************
Tests: 192
Failures: 4
Errors: 0
Success Rate: 97
Total time: 4361.994

****************************************************************************
Test Failures:
****************************************************************************

TestSuite
    initializeContinuum :
  com.thoughtworks.selenium.SeleniumException
  com.thoughtworks.selenium.SeleniumException: Timed out after 30000ms
	at com.thoughtworks.selenium.HttpCommandProcessor.throwAssertionFailureExceptionOrError(HttpCommandProcessor.java:97)
	at com.thoughtworks.selenium.HttpCommandProcessor.doCommand(HttpCommandProcessor.java:91)
	at com.thoughtworks.selenium.DefaultSelenium.open(DefaultSelenium.java:335)
	at org.apache.continuum.web.test.SetupSelenium.initializeContinuum(SetupSelenium.java:65)

    testAddValidIrcGroupNotifier :
  com.thoughtworks.selenium.SeleniumException
  com.thoughtworks.selenium.SeleniumException: Timed out after 60000ms
	at com.thoughtworks.selenium.HttpCommandProcessor.throwAssertionFailureExceptionOrError(HttpCommandProcessor.java:97)
	at com.thoughtworks.selenium.HttpCommandProcessor.doCommand(HttpCommandProcessor.java:91)
	at com.thoughtworks.selenium.DefaultSelenium.waitForPageToLoad(DefaultSelenium.java:635)
	at org.apache.continuum.web.test.parent.AbstractSeleniumTest.waitPage(AbstractSeleniumTest.java:224)
	at org.apache.continuum.web.test.parent.AbstractSeleniumTest.clickLinkWithLocator(AbstractSeleniumTest.java:356)
	at org.apache.continuum.web.test.parent.AbstractSeleniumTest.clickLinkWithXPath(AbstractSeleniumTest.java:342)
	at org.apache.continuum.web.test.parent.AbstractSeleniumTest.clickButtonWithValue(AbstractSeleniumTest.java:306)
	at org.apache.continuum.web.test.parent.AbstractSeleniumTest.clickButtonWithValue(AbstractSeleniumTest.java:293)
	at org.apache.continuum.web.test.parent.AbstractNotifierTest.addIrcNotifier(AbstractNotifierTest.java:239)
	at org.apache.continuum.web.test.NotifierTest.testAddValidIrcGroupNotifier(NotifierTest.java:185)


    testAddMavenOneProjectWithNoDefaultBuildDefinitionFromTemplate :
  java.lang.AssertionError
  java.lang.AssertionError: 'Delete Group' button isn't present expected:<true> but
was:<false>
	at org.testng.Assert.fail(Assert.java:84)
	at org.testng.Assert.failNotEquals(Assert.java:438)
	at org.testng.Assert.assertTrue(Assert.java:32)
	at org.apache.continuum.web.test.parent.AbstractSeleniumTest.assertButtonWithValuePresent(AbstractSeleniumTest.java:267)
	at org.apache.continuum.web.test.parent.AbstractSeleniumTest.clickButtonWithValue(AbstractSeleniumTest.java:298)
	at org.apache.continuum.web.test.parent.AbstractSeleniumTest.clickButtonWithValue(AbstractSeleniumTest.java:293)
	at org.apache.continuum.web.test.parent.AbstractContinuumTest.removeProjectGroup(AbstractContinuumTest.java:337)
	at org.apache.continuum.web.test.MavenOneProjectTest.testAddMavenOneProjectWithNoDefaultBuildDefinitionFromTemplate(MavenOneProjectTest.java:52)

    testQueuePageWithProjectCurrentlyBuilding :
  java.lang.AssertionError
  java.lang.AssertionError: timeout
	at org.testng.Assert.fail(Assert.java:84)
	at org.apache.continuum.web.test.parent.AbstractSeleniumTest.waitForElementPresent(AbstractSeleniumTest.java:414)
	at org.apache.continuum.web.test.parent.AbstractBuildQueueTest.buildProjectForQueuePageTest(AbstractBuildQueueTest.java:93)
	at org.apache.continuum.web.test.QueueTest.testQueuePageWithProjectCurrentlyBuilding(QueueTest.java:133)


  



Mime
View raw message