continuum-notifications mailing list archives

Site index · List index
Message view « Date » · « Thread »
Top « Date » · « Thread »
From "Continuum@vmbuild.apache.org" <contin...@apache.org>
Subject [continuum] BUILD FAILURE: Continuum - Continuum :: Webapp Tests - Maven 2.0.9, Java 5
Date Fri, 29 Jan 2010 08:01:53 GMT
Online report : http://vmbuild.apache.org/continuum/buildResult.action?buildId=277905&projectId=2284

Build statistics:
  State: Failed
  Previous State: Building
  Started at: Thu 28 Jan 2010 23:52:09 -0800
  Finished at: Fri 29 Jan 2010 00:01:38 -0800
  Total time: 9m 29s
  Build Trigger: Schedule
  Build Number: 1
  Exit code: 1
  Building machine hostname: vmbuild.apache.org
  Operating system : Linux(unknown)
  Java Home version : 
          java version "1.5.0_12"
          Java(TM) 2 Runtime Environment, Standard Edition (build 1.5.0_12-b04)
          Java HotSpot(TM) Client VM (build 1.5.0_12-b04, mixed mode, sharing)
        
  Builder version :
          Maven version: 2.0.9
          Java version: 1.5.0_12
          OS name: "linux" version: "2.6.24-23-server" arch: "i386" Family: "unix"
    
****************************************************************************
SCM Changes:
****************************************************************************
Changed: no author @ no date
Comment: no comment
Files changed:
  src/appserver-base/conf/continuum-buildagent.xml ( no revision )
  src/test/testng/config/testng.xml ( no revision )
  src/test/testng/org/apache/continuum/web/test/BuildAgentsTest.java ( no revision )
  src/test/testng/org/apache/continuum/web/test/parent/AbstractReleaseTest.java ( no revision
)
  src/test/testng/org/apache/continuum/web/test/parent/AbstractBuildAgentsTest.java ( no revision
)
  src/test/testng/org/apache/continuum/web/test/parent/AbstractContinuumTest.java ( no revision
)
  src/test/testng/org/apache/continuum/web/test/parent/AbstractSeleniumTest.java ( no revision
)
  src/test/testng/org/apache/continuum/web/test/ReleaseTest.java ( no revision )
  src/test/testng/org/apache/continuum/web/test/ProjectGroupTest.java ( no revision )
  src/test/testng/org/apache/continuum/web/test/MavenTwoProjectTest.java ( no revision )
  src/test/resources/testng.properties ( no revision )
  pom.xml ( no revision )

Changed: brett @ Sun 17 Jan 2010 19:50:27 -0800
Comment: merge recent changes from 1.3.x branch
Files changed:
  /continuum/trunk ( 900276 )
  /continuum/trunk/continuum-api/src/main/java/org/apache/continuum/taskqueue/BuildProjectTask.java
( 900276 )
  /continuum/trunk/continuum-api/src/main/java/org/apache/continuum/taskqueue/CheckOutTask.java
( 900276 )
  /continuum/trunk/continuum-api/src/main/java/org/apache/continuum/taskqueue/PrepareBuildProjectsTask.java
( 900276 )
  /continuum/trunk/continuum-buildagent/continuum-buildagent-core/src/main/java/org/apache/continuum/buildagent/build/execution/manager/BuildAgentBuildExecutorManager.java
( 900276 )
  /continuum/trunk/continuum-buildagent/continuum-buildagent-core/src/main/java/org/apache/continuum/buildagent/build/execution/manager/DefaultBuildAgentBuildExecutorManager.java
( 900276 )
  /continuum/trunk/continuum-buildagent/continuum-buildagent-core/src/main/java/org/apache/continuum/buildagent/build/execution/maven/m1
( 900276 )
  /continuum/trunk/continuum-buildagent/continuum-buildagent-core/src/main/java/org/apache/continuum/buildagent/build/execution/maven/m2/BuildAgentMavenBuilderHelper.java
( 900276 )
  /continuum/trunk/continuum-buildagent/continuum-buildagent-core/src/main/java/org/apache/continuum/buildagent/build/execution/maven/m2/DefaultBuildAgentMavenBuilderHelper.java
( 900276 )
  /continuum/trunk/continuum-buildagent/continuum-buildagent-core/src/main/java/org/apache/continuum/buildagent/configuration/BuildAgentConfiguration.java
( 900276 )
  /continuum/trunk/continuum-buildagent/continuum-buildagent-core/src/main/java/org/apache/continuum/buildagent/configuration/BuildAgentConfigurationException.java
( 900276 )
  /continuum/trunk/continuum-buildagent/continuum-buildagent-core/src/main/java/org/apache/continuum/buildagent/configuration/BuildAgentConfigurationService.java
( 900276 )
  /continuum/trunk/continuum-buildagent/continuum-buildagent-core/src/main/java/org/apache/continuum/buildagent/configuration/DefaultBuildAgentConfiguration.java
( 900276 )
  /continuum/trunk/continuum-buildagent/continuum-buildagent-core/src/main/java/org/apache/continuum/buildagent/configuration/DefaultBuildAgentConfigurationService.java
( 900276 )
  /continuum/trunk/continuum-buildagent/continuum-buildagent-core/src/main/java/org/apache/continuum/buildagent/configuration/GeneralBuildAgentConfiguration.java
( 900276 )
  /continuum/trunk/continuum-buildagent/continuum-buildagent-core/src/main/java/org/apache/continuum/buildagent/installation/BuildAgentInstallationService.java
( 900276 )
  /continuum/trunk/continuum-buildagent/continuum-buildagent-core/src/main/java/org/apache/continuum/buildagent/installation/DefaultBuildAgentInstallationService.java
( 900276 )
  /continuum/trunk/continuum-buildagent/continuum-buildagent-core/src/main/java/org/apache/continuum/buildagent/manager/BuildAgentManager.java
( 900276 )
  /continuum/trunk/continuum-buildagent/continuum-buildagent-core/src/main/java/org/apache/continuum/buildagent/manager/DefaultBuildAgentManager.java
( 900276 )
  /continuum/trunk/continuum-buildagent/continuum-buildagent-core/src/main/java/org/apache/continuum/buildagent/taskqueue/manager/BuildAgentTaskQueueManager.java
( 900276 )
  /continuum/trunk/continuum-buildagent/continuum-buildagent-core/src/main/java/org/apache/continuum/buildagent/taskqueue/manager/DefaultBuildAgentTaskQueueManager.java
( 900276 )
  /continuum/trunk/continuum-builder/src/main/java/org/apache/continuum/builder/distributed/executor/DistributedBuildProjectTaskExecutor.java
( 900276 )
  /continuum/trunk/continuum-builder/src/main/java/org/apache/continuum/builder/distributed/executor/ThreadedDistributedBuildTaskQueueExecutor.java
( 900276 )
  /continuum/trunk/continuum-data-management/data-management-cli ( 900276 )
  /continuum/trunk/continuum-docs/src/site/apt/user_guides/release/release_results.apt ( 900276
)
  /continuum/trunk/continuum-docs/src/site/xdoc ( 900276 )
  /continuum/trunk/continuum-model/src/main/resources/package-default.orm ( 900276 )
  /continuum/trunk/continuum-webapp/pom.xml ( 900276 )
  /continuum/trunk/continuum-webapp/src/main/java/org/apache/continuum/web/action/admin/BuildAgentAction.java
( 900276 )
  /continuum/trunk/continuum-webapp/src/main/webapp/WEB-INF/jsp/admin/confirmDeleteBuildAgent.jsp
( 900276 )
  /continuum/trunk/continuum-webapp-test/src/test/selenium-ide ( 900276 )
  /continuum/trunk/continuum-webapp-test/src/test/testng/org/apache/continuum/web/test/listener/CaptureScreenShotsListener.java
( 900276 )
  /continuum/trunk/src/site ( 900276 )

Changed: ctan @ Mon 11 Jan 2010 18:25:34 -0800
Comment: [CONTINUUM-2411] do not throw exception when there is no default build definition
in the template. only log a warning saying that project cannot be checked out without a build
definition
merge -r 898152:898153 of 1.3.x branch
Files changed:
  /continuum/trunk/continuum-core/src/main/java/org/apache/maven/continuum/DefaultContinuum.java
( 898154 )
  /continuum/trunk/continuum-webapp-test/src/test/testng/org/apache/continuum/web/test/MavenOneProjectTest.java
( 898154 )
  /continuum/trunk/continuum-webapp-test/src/test/testng/org/apache/continuum/web/test/MavenTwoProjectTest.java
( 898154 )
  /continuum/trunk/continuum-webapp-test/src/test/testng/org/apache/continuum/web/test/parent/AbstractContinuumTest.java
( 898154 )
  /continuum/trunk/continuum-webapp-test/src/test/testng/org/apache/continuum/web/test/parent/AbstractSeleniumTest.java
( 898154 )

****************************************************************************
Dependencies Changes:
****************************************************************************
org.apache.continuum:continuum-webapp:1.4.0-SNAPSHOT

org.apache.continuum:continuum-buildagent-webapp:1.4.0-SNAPSHOT

org.apache.continuum:continuum:1.4.0-SNAPSHOT


****************************************************************************
Build Definition:
****************************************************************************
POM filename: pom.xml
Goals: clean install   
Arguments: --batch-mode --non-recursive -U -P headless
Build Fresh: false
Always Build: false
Default Build Definition: true
Schedule: DEFAULT_SCHEDULE
Profile Name: Maven 2.0.9, Java 5
Description: Maven 2.0.9, Java 5

****************************************************************************
Test Summary:
****************************************************************************
Tests: 196
Failures: 2
Errors: 0
Success Rate: 98
Total time: 304.145

****************************************************************************
Test Failures:
****************************************************************************

TestSuite
    initializeContinuum :
  java.lang.RuntimeException
  java.lang.RuntimeException: Could not start Selenium session: Failed to start new browser
session: Error while launching browser
	at com.thoughtworks.selenium.DefaultSelenium.start(DefaultSelenium.java:89)
	at org.apache.continuum.web.test.parent.AbstractSeleniumTest.open(AbstractSeleniumTest.java:80)
	at org.apache.continuum.web.test.SetupSelenium.initializeContinuum(SetupSelenium.java:63)
Caused by: com.thoughtworks.selenium.SeleniumException: Failed to start new browser session:
Error while launching browser
	at com.thoughtworks.selenium.HttpCommandProcessor.throwAssertionFailureExceptionOrError(HttpCommandProcessor.java:97)
	at com.thoughtworks.selenium.HttpCommandProcessor.doCommand(HttpCommandProcessor.java:91)
	at com.thoughtworks.selenium.HttpCommandProcessor.getString(HttpCommandProcessor.java:262)
	at com.thoughtworks.selenium.HttpCommandProcessor.start(HttpCommandProcessor.java:223)
	at com.thoughtworks.selenium.DefaultSelenium.start(DefaultSelenium.java:81)
	... 28 more

    initializeContinuum :
  java.lang.RuntimeException
  java.lang.RuntimeException: Could not start Selenium session: Failed to start new browser
session: Error while launching browser
	at com.thoughtworks.selenium.DefaultSelenium.start(DefaultSelenium.java:89)
	at org.apache.continuum.web.test.parent.AbstractSeleniumTest.open(AbstractSeleniumTest.java:80)
	at org.apache.continuum.web.test.SetupSelenium.initializeContinuum(SetupSelenium.java:63)
Caused by: com.thoughtworks.selenium.SeleniumException: Failed to start new browser session:
Error while launching browser
	at com.thoughtworks.selenium.HttpCommandProcessor.throwAssertionFailureExceptionOrError(HttpCommandProcessor.java:97)
	at com.thoughtworks.selenium.HttpCommandProcessor.doCommand(HttpCommandProcessor.java:91)
	at com.thoughtworks.selenium.HttpCommandProcessor.getString(HttpCommandProcessor.java:262)
	at com.thoughtworks.selenium.HttpCommandProcessor.start(HttpCommandProcessor.java:223)
	at com.thoughtworks.selenium.DefaultSelenium.start(DefaultSelenium.java:81)
	... 28 more


  



Mime
View raw message