continuum-notifications mailing list archives

Site index · List index
Message view « Date » · « Thread »
Top « Date » · « Thread »
From "Continuum@vmbuild.apache.org" <contin...@apache.org>
Subject [continuum] BUILD FAILURE: Continuum - Continuum Webapp Test - Maven 2.0.9, Java 5
Date Wed, 11 Nov 2009 00:58:44 GMT
Online report : http://vmbuild.apache.org/continuum/buildResult.action?buildId=251389&projectId=2284

Build statistics:
  State: Failed
  Previous State: Failed
  Started at: Tue 10 Nov 2009 16:48:12 -0800
  Finished at: Tue 10 Nov 2009 16:58:41 -0800
  Total time: 10m 28s
  Build Trigger: Schedule
  Build Number: 1
  Exit code: 1
  Building machine hostname: vmbuild.apache.org
  Operating system : Linux(unknown)
  Java Home version : 
          java version "1.5.0_12"
          Java(TM) 2 Runtime Environment, Standard Edition (build 1.5.0_12-b04)
          Java HotSpot(TM) Client VM (build 1.5.0_12-b04, mixed mode, sharing)
        
  Builder version :
          Maven version: 2.0.9
          Java version: 1.5.0_12
          OS name: "linux" version: "2.6.24-23-server" arch: "i386" Family: "unix"
    
****************************************************************************
SCM Changes:
****************************************************************************
Changed: ctan @ Tue 10 Nov 2009 15:47:26 -0800
Comment: [CONTINUUM-2387] fixed members tab for groups that start or end with the same string
merge -r 834712:834713 of 1.3.x branch
Files changed:
  /continuum/trunk/continuum-webapp/src/main/java/org/apache/maven/continuum/web/action/ProjectGroupAction.java
( 834714 )
  /continuum/trunk/continuum-webapp-test/src/test/resources/testng.properties ( 834714 )
  /continuum/trunk/continuum-webapp-test/src/test/testng/org/apache/continuum/web/test/ProjectGroupTest.java
( 834714 )

Changed: ctan @ Tue 10 Nov 2009 15:55:56 -0800
Comment: fixed unit test in userroles
merge -r 834717 of 1.3.x branch
Files changed:
  /continuum/trunk/continuum-webapp-test/src/test/testng/org/apache/continuum/web/test/UserRolesManagementTest.java
( 834718 )

****************************************************************************
Dependencies Changes:
****************************************************************************
org.apache.continuum:continuum-webapp:1.4.0-SNAPSHOT


****************************************************************************
Build Definition:
****************************************************************************
POM filename: pom.xml
Goals: clean install   
Arguments: --batch-mode --non-recursive -U -P headless
Build Fresh: false
Always Build: false
Default Build Definition: true
Schedule: DEFAULT_SCHEDULE
Profile Name: Maven 2.0.9, Java 5
Description: Maven 2.0.9, Java 5

****************************************************************************
Test Summary:
****************************************************************************
Tests: 196
Failures: 2
Errors: 0
Success Rate: 98
Total time: 159.773

****************************************************************************
Test Failures:
****************************************************************************

TestSuite
    initializeContinuum :
  java.lang.RuntimeException
  java.lang.RuntimeException: Could not start Selenium session: Failed to start new browser
session: Error while launching browser
	at com.thoughtworks.selenium.DefaultSelenium.start(DefaultSelenium.java:89)
	at org.apache.continuum.web.test.parent.AbstractSeleniumTest.open(AbstractSeleniumTest.java:80)
	at org.apache.continuum.web.test.SetupSelenium.initializeContinuum(SetupSelenium.java:63)
Caused by: com.thoughtworks.selenium.SeleniumException: Failed to start new browser session:
Error while launching browser
	at com.thoughtworks.selenium.HttpCommandProcessor.throwAssertionFailureExceptionOrError(HttpCommandProcessor.java:97)
	at com.thoughtworks.selenium.HttpCommandProcessor.doCommand(HttpCommandProcessor.java:91)
	at com.thoughtworks.selenium.HttpCommandProcessor.getString(HttpCommandProcessor.java:262)
	at com.thoughtworks.selenium.HttpCommandProcessor.start(HttpCommandProcessor.java:223)
	at com.thoughtworks.selenium.DefaultSelenium.start(DefaultSelenium.java:81)
	... 28 more

    initializeContinuum :
  java.lang.RuntimeException
  java.lang.RuntimeException: Could not start Selenium session: Failed to start new browser
session: Error while launching browser
	at com.thoughtworks.selenium.DefaultSelenium.start(DefaultSelenium.java:89)
	at org.apache.continuum.web.test.parent.AbstractSeleniumTest.open(AbstractSeleniumTest.java:80)
	at org.apache.continuum.web.test.SetupSelenium.initializeContinuum(SetupSelenium.java:63)
Caused by: com.thoughtworks.selenium.SeleniumException: Failed to start new browser session:
Error while launching browser
	at com.thoughtworks.selenium.HttpCommandProcessor.throwAssertionFailureExceptionOrError(HttpCommandProcessor.java:97)
	at com.thoughtworks.selenium.HttpCommandProcessor.doCommand(HttpCommandProcessor.java:91)
	at com.thoughtworks.selenium.HttpCommandProcessor.getString(HttpCommandProcessor.java:262)
	at com.thoughtworks.selenium.HttpCommandProcessor.start(HttpCommandProcessor.java:223)
	at com.thoughtworks.selenium.DefaultSelenium.start(DefaultSelenium.java:81)
	... 28 more


  



Mime
View raw message