continuum-notifications mailing list archives: August 2009

Site index · List index
Message list1 · 2 · 3 · 4 · Next »Thread · Author · Date
Contin...@vmbuild.apache.org [continuum] BUILD FAILURE: Continuum - Continuum :: Web APP - Maven 2.0.9, Java 5 Mon, 03 Aug, 00:37
Contin...@vmbuild.apache.org [continuum] BUILD SUCCESSFUL: Continuum - Continuum :: Web APP - Maven 2.0.9, Java 5 Tue, 04 Aug, 04:23
Contin...@vmbuild.apache.org [continuum] BUILD FAILURE: Continuum - Continuum Webapp Test - Maven 2.0.9, Java 5 Tue, 04 Aug, 04:33
Contin...@vmbuild.apache.org [continuum] BUILD FAILURE: Continuum - Continuum Webapp Test - Maven 2.0.9, Java 5 Tue, 04 Aug, 16:08
Contin...@vmbuild.apache.org [continuum] BUILD FAILURE: Continuum - Continuum Webapp Test - Maven 2.0.9, Java 5 Wed, 05 Aug, 10:28
Contin...@vmbuild.apache.org [continuum] PREPARE BUILD ERROR: ${project.projectGroup.name} Sun, 09 Aug, 03:01
Contin...@vmbuild.apache.org [continuum] PREPARE BUILD ERROR: ${project.projectGroup.name} Sun, 09 Aug, 04:01
Contin...@vmbuild.apache.org [continuum] PREPARE BUILD ERROR: ${project.projectGroup.name} Sun, 09 Aug, 05:01
Contin...@vmbuild.apache.org [continuum] PREPARE BUILD ERROR: ${project.projectGroup.name} Sun, 09 Aug, 06:01
Contin...@vmbuild.apache.org [continuum] PREPARE BUILD ERROR: ${project.projectGroup.name} Sun, 09 Aug, 07:01
Contin...@vmbuild.apache.org [continuum] PREPARE BUILD ERROR: ${project.projectGroup.name} Sun, 09 Aug, 08:01
Contin...@vmbuild.apache.org [continuum] PREPARE BUILD ERROR: ${project.projectGroup.name} Sun, 09 Aug, 09:01
Contin...@vmbuild.apache.org [continuum] PREPARE BUILD ERROR: ${project.projectGroup.name} Sun, 09 Aug, 10:01
Contin...@vmbuild.apache.org [continuum] BUILD FAILURE: Continuum - Continuum Webapp Test - Maven 2.0.9, Java 5 Mon, 10 Aug, 05:38
Contin...@vmbuild.apache.org [continuum] BUILD FAILURE: Continuum 1.3.X - Continuum :: Web APP - default maven2 buildDefinition Wed, 12 Aug, 07:28
Contin...@vmbuild.apache.org [continuum] BUILD FAILURE: Continuum - Continuum :: Web APP - Maven 2.0.9, Java 5 Wed, 12 Aug, 07:37
Contin...@vmbuild.apache.org [continuum] BUILD FAILURE: Continuum 1.3.X - Continuum :: Web APP - default maven2 buildDefinition Wed, 12 Aug, 09:16
Contin...@vmbuild.apache.org [continuum] BUILD FAILURE: Continuum - Continuum :: Web APP - Maven 2.0.9, Java 5 Wed, 12 Aug, 09:25
Contin...@vmbuild.apache.org [continuum] BUILD ERROR: Continuum - Continuum :: Purge System - Maven 2.0.9, Java 5 Fri, 14 Aug, 19:59
Contin...@vmbuild.apache.org [continuum] BUILD ERROR: Continuum - Continuum :: Distributed Build :: Transport - Maven 2.0.9, Java 5 Fri, 14 Aug, 20:00
Contin...@vmbuild.apache.org [continuum] BUILD ERROR: Continuum - Continuum :: Distributed Build :: Transport :: Slave - Maven 2.0.9, Java 5 Fri, 14 Aug, 20:00
Contin...@vmbuild.apache.org [continuum] BUILD ERROR: Continuum - Continuum :: Distributed Build :: Transport :: Slave :: API - Maven 2.0.9, Java 5 Fri, 14 Aug, 20:00
Contin...@vmbuild.apache.org [continuum] BUILD ERROR: Continuum - Continuum :: Distributed Build :: Transport :: Slave :: Client - Maven 2.0.9, Java 5 Fri, 14 Aug, 20:01
Contin...@vmbuild.apache.org [continuum] BUILD ERROR: Continuum - Continuum :: Builder - Maven 2.0.9, Java 5 Fri, 14 Aug, 20:01
Contin...@vmbuild.apache.org [continuum] BUILD ERROR: Continuum - Continuum :: Core - Maven 2.0.9, Java 5 Fri, 14 Aug, 20:01
Contin...@vmbuild.apache.org [continuum] BUILD ERROR: Continuum - Continuum :: IRC Notifier - Maven 2.0.9, Java 5 Fri, 14 Aug, 20:01
Contin...@vmbuild.apache.org [continuum] BUILD ERROR: Continuum - Continuum :: Jabber Notifier - Maven 2.0.9, Java 5 Fri, 14 Aug, 20:01
Contin...@vmbuild.apache.org [continuum] BUILD ERROR: Continuum - Continuum :: MSN Notifier - Maven 2.0.9, Java 5 Fri, 14 Aug, 20:02
Contin...@vmbuild.apache.org [continuum] BUILD ERROR: Continuum - Continuum :: Wagon Notifier - Maven 2.0.9, Java 5 Fri, 14 Aug, 20:02
Contin...@vmbuild.apache.org [continuum] BUILD ERROR: Continuum - Continuum :: XMLRPC :: Parent - Maven 2.0.9, Java 5 Fri, 14 Aug, 20:02
Contin...@vmbuild.apache.org [continuum] BUILD ERROR: Continuum - Continuum :: XMLRPC :: API - Maven 2.0.9, Java 5 Fri, 14 Aug, 20:02
Contin...@vmbuild.apache.org [continuum] BUILD ERROR: Continuum - Continuum :: XMLRPC :: Server - Maven 2.0.9, Java 5 Fri, 14 Aug, 20:03
Contin...@vmbuild.apache.org [continuum] BUILD ERROR: Continuum - Continuum :: Distributed Build :: Transport :: Master - Maven 2.0.9, Java 5 Fri, 14 Aug, 20:03
Contin...@vmbuild.apache.org [continuum] BUILD ERROR: Continuum - Continuum :: Distributed Build :: Transport :: Master :: API - Maven 2.0.9, Java 5 Fri, 14 Aug, 20:04
Contin...@vmbuild.apache.org [continuum] BUILD ERROR: Continuum - Continuum :: Distributed Build :: Transport :: Master :: Server - Maven 2.0.9, Java 5 Fri, 14 Aug, 20:04
Contin...@vmbuild.apache.org [continuum] BUILD ERROR: Continuum - Continuum :: XMLRPC :: Client - Maven 2.0.9, Java 5 Fri, 14 Aug, 20:04
Contin...@vmbuild.apache.org [continuum] BUILD ERROR: Continuum - Continuum :: XMLRPC :: Backup Tool - Maven 2.0.9, Java 5 Fri, 14 Aug, 20:05
Contin...@vmbuild.apache.org [continuum] BUILD ERROR: Continuum - Continuum :: Data Management :: Parent - Maven 2.0.9, Java 5 Fri, 14 Aug, 20:05
Contin...@vmbuild.apache.org [continuum] BUILD ERROR: Continuum - Continuum :: Data Management :: API - Maven 2.0.9, Java 5 Fri, 14 Aug, 20:05
Contin...@vmbuild.apache.org [continuum] BUILD ERROR: Continuum - Continuum :: Data Management :: CLI - Maven 2.0.9, Java 5 Fri, 14 Aug, 20:05
Contin...@vmbuild.apache.org [continuum] BUILD ERROR: Continuum - Continuum :: Legacy Model - Maven 2.0.9, Java 5 Fri, 14 Aug, 20:06
Contin...@vmbuild.apache.org [continuum] BUILD ERROR: Continuum - Continuum :: Data Management :: JDO - Maven 2.0.9, Java 5 Fri, 14 Aug, 20:06
Contin...@vmbuild.apache.org [continuum] BUILD ERROR: Continuum - Continuum :: Redback :: Legacy Model - Maven 2.0.9, Java 5 Fri, 14 Aug, 20:06
Contin...@vmbuild.apache.org [continuum] BUILD ERROR: Continuum - Continuum :: Data Management :: Redback JDO - Maven 2.0.9, Java 5 Fri, 14 Aug, 20:06
Contin...@vmbuild.apache.org [continuum] BUILD ERROR: Continuum - Apache Continuum - Maven 2.0.9, Java 5 Fri, 14 Aug, 20:06
Contin...@vmbuild.apache.org [continuum] BUILD ERROR: Continuum - Continuum :: Distributed Build :: Transport :: Master :: Client - Maven 2.0.9, Java 5 Fri, 14 Aug, 20:07
Contin...@vmbuild.apache.org [continuum] BUILD ERROR: Continuum - Continuum :: Distributed Build :: Build Agent - Maven 2.0.9, Java 5 Fri, 14 Aug, 20:07
Contin...@vmbuild.apache.org [continuum] BUILD ERROR: Continuum - Continuum :: Distributed Build :: Build Agent API - Maven 2.0.9, Java 5 Fri, 14 Aug, 20:07
Contin...@vmbuild.apache.org [continuum] BUILD ERROR: Continuum - Continuum :: Distributed Build :: Transport :: Slave :: Server - Maven 2.0.9, Java 5 Fri, 14 Aug, 20:07
Contin...@vmbuild.apache.org [continuum] BUILD ERROR: Continuum - Continuum :: Distributed Build :: Build Agent :: Core - Maven 2.0.9, Java 5 Fri, 14 Aug, 20:07
Contin...@vmbuild.apache.org [continuum] BUILD ERROR: Continuum - Continuum :: Distributed Build :: Build Agent :: Webapp - Maven 2.0.9, Java 5 Fri, 14 Aug, 20:08
Contin...@vmbuild.apache.org [continuum] BUILD ERROR: Continuum - Apache Continuum Build Agent - Maven 2.0.9, Java 5 Fri, 14 Aug, 20:08
Contin...@vmbuild.apache.org [continuum] BUILD ERROR: Continuum - Continuum Webapp Test - Maven 2.0.9, Java 5 Fri, 14 Aug, 20:08
Contin...@vmbuild.apache.org [continuum] BUILD FAILURE: Continuum - Continuum :: Purge System - Maven 2.0.9, Java 5 Fri, 14 Aug, 21:31
Contin...@vmbuild.apache.org [continuum] BUILD FAILURE: Continuum - Continuum :: Distributed Build :: Transport - Maven 2.0.9, Java 5 Fri, 14 Aug, 21:31
Contin...@vmbuild.apache.org [continuum] BUILD FAILURE: Continuum - Continuum :: Distributed Build :: Transport :: Slave - Maven 2.0.9, Java 5 Fri, 14 Aug, 21:32
Contin...@vmbuild.apache.org [continuum] BUILD FAILURE: Continuum - Continuum :: Distributed Build :: Transport :: Slave :: API - Maven 2.0.9, Java 5 Fri, 14 Aug, 21:33
Contin...@vmbuild.apache.org [continuum] BUILD FAILURE: Continuum - Continuum :: Distributed Build :: Transport :: Slave :: Client - Maven 2.0.9, Java 5 Fri, 14 Aug, 21:34
Contin...@vmbuild.apache.org [continuum] BUILD FAILURE: Continuum - Continuum :: Builder - Maven 2.0.9, Java 5 Fri, 14 Aug, 21:34
Contin...@vmbuild.apache.org [continuum] BUILD FAILURE: Continuum - Continuum :: Core - Maven 2.0.9, Java 5 Fri, 14 Aug, 21:36
Contin...@vmbuild.apache.org [continuum] BUILD FAILURE: Continuum - Continuum :: IRC Notifier - Maven 2.0.9, Java 5 Fri, 14 Aug, 21:36
Contin...@vmbuild.apache.org [continuum] BUILD FAILURE: Continuum - Continuum :: Jabber Notifier - Maven 2.0.9, Java 5 Fri, 14 Aug, 21:37
Contin...@vmbuild.apache.org [continuum] BUILD FAILURE: Continuum - Continuum :: MSN Notifier - Maven 2.0.9, Java 5 Fri, 14 Aug, 21:37
Contin...@vmbuild.apache.org [continuum] BUILD FAILURE: Continuum - Continuum :: Wagon Notifier - Maven 2.0.9, Java 5 Fri, 14 Aug, 21:38
Contin...@vmbuild.apache.org [continuum] BUILD FAILURE: Continuum - Continuum :: XMLRPC :: Parent - Maven 2.0.9, Java 5 Fri, 14 Aug, 21:39
Contin...@vmbuild.apache.org [continuum] BUILD FAILURE: Continuum - Continuum :: XMLRPC :: API - Maven 2.0.9, Java 5 Fri, 14 Aug, 21:39
Contin...@vmbuild.apache.org [continuum] BUILD FAILURE: Continuum - Continuum :: XMLRPC :: Server - Maven 2.0.9, Java 5 Fri, 14 Aug, 21:40
Contin...@vmbuild.apache.org [continuum] BUILD FAILURE: Continuum - Continuum :: Distributed Build :: Transport :: Master - Maven 2.0.9, Java 5 Fri, 14 Aug, 21:40
Contin...@vmbuild.apache.org [continuum] BUILD FAILURE: Continuum - Continuum :: Distributed Build :: Transport :: Master :: API - Maven 2.0.9, Java 5 Fri, 14 Aug, 21:40
Contin...@vmbuild.apache.org [continuum] BUILD FAILURE: Continuum - Continuum :: Distributed Build :: Transport :: Master :: Server - Maven 2.0.9, Java 5 Fri, 14 Aug, 21:41
Contin...@vmbuild.apache.org [continuum] BUILD FAILURE: Continuum - Continuum :: XMLRPC :: Client - Maven 2.0.9, Java 5 Fri, 14 Aug, 21:42
Contin...@vmbuild.apache.org [continuum] BUILD FAILURE: Continuum - Continuum :: XMLRPC :: Backup Tool - Maven 2.0.9, Java 5 Fri, 14 Aug, 21:43
Contin...@vmbuild.apache.org [continuum] BUILD FAILURE: Continuum - Continuum :: Data Management :: Parent - Maven 2.0.9, Java 5 Fri, 14 Aug, 21:44
Contin...@vmbuild.apache.org [continuum] BUILD FAILURE: Continuum - Continuum :: Data Management :: API - Maven 2.0.9, Java 5 Fri, 14 Aug, 21:44
Contin...@vmbuild.apache.org [continuum] BUILD FAILURE: Continuum - Continuum :: Data Management :: CLI - Maven 2.0.9, Java 5 Fri, 14 Aug, 21:45
Contin...@vmbuild.apache.org [continuum] BUILD FAILURE: Continuum - Continuum :: Legacy Model - Maven 2.0.9, Java 5 Fri, 14 Aug, 21:46
Contin...@vmbuild.apache.org [continuum] BUILD FAILURE: Continuum - Continuum :: Data Management :: JDO - Maven 2.0.9, Java 5 Fri, 14 Aug, 21:46
Contin...@vmbuild.apache.org [continuum] BUILD FAILURE: Continuum - Continuum :: Redback :: Legacy Model - Maven 2.0.9, Java 5 Fri, 14 Aug, 21:47
Contin...@vmbuild.apache.org [continuum] BUILD FAILURE: Continuum - Continuum :: Data Management :: Redback JDO - Maven 2.0.9, Java 5 Fri, 14 Aug, 21:48
Contin...@vmbuild.apache.org [continuum] BUILD FAILURE: Continuum - Apache Continuum - Maven 2.0.9, Java 5 Fri, 14 Aug, 21:48
Contin...@vmbuild.apache.org [continuum] BUILD FAILURE: Continuum - Continuum :: Distributed Build :: Transport :: Master :: Client - Maven 2.0.9, Java 5 Fri, 14 Aug, 21:49
Contin...@vmbuild.apache.org [continuum] BUILD FAILURE: Continuum - Continuum :: Distributed Build :: Build Agent - Maven 2.0.9, Java 5 Fri, 14 Aug, 21:50
Contin...@vmbuild.apache.org [continuum] BUILD FAILURE: Continuum - Continuum :: Distributed Build :: Build Agent API - Maven 2.0.9, Java 5 Fri, 14 Aug, 21:51
Contin...@vmbuild.apache.org [continuum] BUILD FAILURE: Continuum - Continuum :: Distributed Build :: Transport :: Slave :: Server - Maven 2.0.9, Java 5 Fri, 14 Aug, 21:51
Contin...@vmbuild.apache.org [continuum] BUILD FAILURE: Continuum - Continuum :: Distributed Build :: Build Agent :: Core - Maven 2.0.9, Java 5 Fri, 14 Aug, 21:52
Contin...@vmbuild.apache.org [continuum] BUILD FAILURE: Continuum - Continuum :: Distributed Build :: Build Agent :: Webapp - Maven 2.0.9, Java 5 Fri, 14 Aug, 21:52
Contin...@vmbuild.apache.org [continuum] BUILD FAILURE: Continuum - Apache Continuum Build Agent - Maven 2.0.9, Java 5 Fri, 14 Aug, 21:53
Contin...@vmbuild.apache.org [continuum] BUILD FAILURE: Continuum - Continuum Webapp Test - Maven 2.0.9, Java 5 Fri, 14 Aug, 21:55
Contin...@vmbuild.apache.org [continuum] BUILD ERROR: Continuum 1.3.X - Continuum :: Distributed Build :: Transport :: Slave :: Client - default maven2 buildDefinition Sun, 16 Aug, 05:43
Contin...@vmbuild.apache.org [continuum] BUILD ERROR: Continuum 1.3.X - Continuum :: Builder - default maven2 buildDefinition Sun, 16 Aug, 05:43
Contin...@vmbuild.apache.org [continuum] BUILD ERROR: Continuum 1.3.X - Continuum :: Core - default maven2 buildDefinition Sun, 16 Aug, 05:44
Contin...@vmbuild.apache.org [continuum] BUILD ERROR: Continuum 1.3.X - Continuum :: IRC Notifier - default maven2 buildDefinition Sun, 16 Aug, 05:44
Contin...@vmbuild.apache.org [continuum] BUILD ERROR: Continuum 1.3.X - Continuum :: Jabber Notifier - default maven2 buildDefinition Sun, 16 Aug, 05:44
Contin...@vmbuild.apache.org [continuum] BUILD ERROR: Continuum 1.3.X - Continuum :: MSN Notifier - default maven2 buildDefinition Sun, 16 Aug, 05:44
Contin...@vmbuild.apache.org [continuum] BUILD ERROR: Continuum 1.3.X - Continuum :: Wagon Notifier - default maven2 buildDefinition Sun, 16 Aug, 05:45
Contin...@vmbuild.apache.org [continuum] BUILD ERROR: Continuum 1.3.X - Continuum :: XMLRPC :: Parent - default maven2 buildDefinition Sun, 16 Aug, 05:45
Contin...@vmbuild.apache.org [continuum] BUILD ERROR: Continuum 1.3.X - Continuum :: XMLRPC :: API - default maven2 buildDefinition Sun, 16 Aug, 05:45
Contin...@vmbuild.apache.org [continuum] BUILD ERROR: Continuum 1.3.X - Continuum :: XMLRPC :: Server - default maven2 buildDefinition Sun, 16 Aug, 05:45
Contin...@vmbuild.apache.org [continuum] BUILD ERROR: Continuum 1.3.X - Continuum :: Distributed Build :: Transport :: Master - default maven2 buildDefinition Sun, 16 Aug, 05:46
Contin...@vmbuild.apache.org [continuum] BUILD ERROR: Continuum 1.3.X - Continuum :: Distributed Build :: Transport :: Master :: API - default maven2 buildDefinition Sun, 16 Aug, 05:46
Message list1 · 2 · 3 · 4 · Next »Thread · Author · Date
Box list
Jul 20142
Jun 20141
Apr 20141
Jan 201410
Sep 20132
Aug 20132
Apr 20131
Mar 20131
Feb 20131
Jan 201312
Dec 20127
Nov 201212
Oct 201210
Sep 20121
Aug 201214
Jul 20124
May 201281
Apr 20121
Mar 20121
Feb 20122
Jan 20123
Dec 20111
Sep 20113
Aug 201123
Jul 20118
Jun 20113
May 20114
Apr 20113
Mar 20112
Dec 20103
Nov 20103
Oct 20101
Aug 20108
Jul 201011
Jun 201048
May 201015
Apr 201011
Mar 2010598
Feb 201021
Jan 201056
Dec 20098
Nov 20094
Oct 200921
Sep 200924
Aug 2009335
Jul 200980
Jun 200944
May 2009170
Apr 2009266
Mar 2009202
Feb 2009226
Jan 2009193
Dec 200874
Nov 2008144
Oct 2008132
Sep 2008227
Aug 2008201
Jul 2008112
Jun 20086
May 2008215
Apr 2008253
Mar 200845