continuum-notifications mailing list archives

Site index · List index
Message view « Date » · « Thread »
Top « Date » · « Thread »
From "Continuum@vmbuild.apache.org" <contin...@apache.org>
Subject [continuum] BUILD FAILURE: Continuum - Continuum Webapp Test - Maven 2.0.9, Java 5
Date Fri, 10 Jul 2009 19:32:59 GMT
Online report : http://vmbuild.apache.org/continuum/buildResult.action?buildId=198833&projectId=2284

Build statistics:
  State: Failed
  Previous State: Failed
  Started at: Fri 10 Jul 2009 12:27:13 -0700
  Finished at: Fri 10 Jul 2009 12:32:47 -0700
  Total time: 5m 33s
  Build Trigger: Schedule
  Build Number: 1
  Exit code: 1
  Building machine hostname: vmbuild.apache.org
  Operating system : Linux(unknown)
  Java Home version : 
          java version "1.5.0_12"
          Java(TM) 2 Runtime Environment, Standard Edition (build 1.5.0_12-b04)
          Java HotSpot(TM) Client VM (build 1.5.0_12-b04, mixed mode, sharing)
        
  Builder version :
          Maven version: 2.0.9
          Java version: 1.5.0_12
          OS name: "linux" version: "2.6.24-23-server" arch: "i386" Family: "unix"
    
****************************************************************************
SCM Changes:
****************************************************************************
Changed: carlos @ Fri 10 Jul 2009 11:42:36 -0700
Comment: Enable passing selenium host and port from maven os system properties
Files changed:
  /continuum/trunk/continuum-webapp-test/pom.xml ( 793073 )
  /continuum/trunk/continuum-webapp-test/src/test/resources/testng.properties ( 793073 )
  /continuum/trunk/continuum-webapp-test/src/test/testng/org/apache/continuum/web/test/SetupSelenium.java
( 793073 )
  /continuum/trunk/continuum-webapp-test/src/test/testng/org/apache/continuum/web/test/parent/AbstractSeleniumTest.java
( 793073 )

Changed: carlos @ Fri 10 Jul 2009 11:44:13 -0700
Comment: Enable passing selenium host and port from maven os system properties
Files changed:
  /continuum/trunk/continuum-webapp-test/Readme.txt ( 793076 )

****************************************************************************
Dependencies Changes:
****************************************************************************
No dependencies changed


****************************************************************************
Build Definition:
****************************************************************************
POM filename: pom.xml
Goals: clean install   
Arguments: --batch-mode --non-recursive -U -P headless
Build Fresh: false
Always Build: false
Default Build Definition: true
Schedule: DEFAULT_SCHEDULE
Profile Name: Maven 2.0.9, Java 5
Description: Maven 2.0.9, Java 5

****************************************************************************
Test Summary:
****************************************************************************
Tests: 183
Failures: 2
Errors: 0
Success Rate: 98
Total time: 152.663

****************************************************************************
Test Failures:
****************************************************************************

TestSuite
    initializeContinuum :
  java.lang.NumberFormatException
  java.lang.NumberFormatException: For input string: "${seleniumPort}"
	at java.lang.NumberFormatException.forInputString(NumberFormatException.java:48)
	at java.lang.Integer.parseInt(Integer.java:447)
	at java.lang.Integer.parseInt(Integer.java:497)
	at org.testng.internal.Parameters.convertType(Parameters.java:173)
	at org.testng.internal.Parameters.createParameters(Parameters.java:127)
	at org.testng.internal.Parameters.createParameters(Parameters.java:274)
	at org.testng.internal.Parameters.createConfigurationParameters(Parameters.java:70)
	at org.testng.internal.Invoker.invokeConfigurations(Invoker.java:135)
	at org.testng.internal.Invoker.invokeConfigurations(Invoker.java:82)
	at org.testng.TestRunner.beforeRun(TestRunner.java:501)
	at org.testng.TestRunner.run(TestRunner.java:469)
	at org.testng.SuiteRunner.runTest(SuiteRunner.java:324)
	at org.testng.SuiteRunner.runSequentially(SuiteRunner.java:319)
	at org.testng.SuiteRunner.privateRun(SuiteRunner.java:292)
	at org.testng.SuiteRunner.run(SuiteRunner.java:198)
	at org.testng.TestNG.createAndRunSuiteRunners(TestNG.java:821)
	at org.testng.TestNG.runSuitesLocally(TestNG.java:788)
	at org.testng.TestNG.run(TestNG.java:708)
	at org.apache.maven.surefire.testng.TestNGExecutor.run(TestNGExecutor.java:74)
	at org.apache.maven.surefire.testng.TestNGXmlTestSuite.execute(TestNGXmlTestSuite.java:92)
	at org.apache.maven.surefire.Surefire.run(Surefire.java:177)
	at sun.reflect.NativeMethodAccessorImpl.invoke0(Native Method)
	at sun.reflect.NativeMethodAccessorImpl.invoke(NativeMethodAccessorImpl.java:39)
	at sun.reflect.DelegatingMethodAccessorImpl.invoke(DelegatingMethodAccessorImpl.java:25)
	at java.lang.reflect.Method.invoke(Method.java:585)
	at org.apache.maven.surefire.booter.SurefireBooter.runSuitesInProcess(SurefireBooter.java:345)
	at org.apache.maven.surefire.booter.SurefireBooter.main(SurefireBooter.java:1009)

    initializeContinuum :
  java.lang.NumberFormatException
  java.lang.NumberFormatException: For input string: "${seleniumPort}"
	at java.lang.NumberFormatException.forInputString(NumberFormatException.java:48)
	at java.lang.Integer.parseInt(Integer.java:447)
	at java.lang.Integer.parseInt(Integer.java:497)
	at org.testng.internal.Parameters.convertType(Parameters.java:173)
	at org.testng.internal.Parameters.createParameters(Parameters.java:127)
	at org.testng.internal.Parameters.createParameters(Parameters.java:274)
	at org.testng.internal.Parameters.createConfigurationParameters(Parameters.java:70)
	at org.testng.internal.Invoker.invokeConfigurations(Invoker.java:135)
	at org.testng.internal.Invoker.invokeConfigurations(Invoker.java:82)
	at org.testng.TestRunner.beforeRun(TestRunner.java:501)
	at org.testng.TestRunner.run(TestRunner.java:469)
	at org.testng.SuiteRunner.runTest(SuiteRunner.java:324)
	at org.testng.SuiteRunner.runSequentially(SuiteRunner.java:319)
	at org.testng.SuiteRunner.privateRun(SuiteRunner.java:292)
	at org.testng.SuiteRunner.run(SuiteRunner.java:198)
	at org.testng.TestNG.createAndRunSuiteRunners(TestNG.java:821)
	at org.testng.TestNG.runSuitesLocally(TestNG.java:788)
	at org.testng.TestNG.run(TestNG.java:708)
	at org.apache.maven.surefire.testng.TestNGExecutor.run(TestNGExecutor.java:74)
	at org.apache.maven.surefire.testng.TestNGXmlTestSuite.execute(TestNGXmlTestSuite.java:92)
	at org.apache.maven.surefire.Surefire.run(Surefire.java:177)
	at sun.reflect.NativeMethodAccessorImpl.invoke0(Native Method)
	at sun.reflect.NativeMethodAccessorImpl.invoke(NativeMethodAccessorImpl.java:39)
	at sun.reflect.DelegatingMethodAccessorImpl.invoke(DelegatingMethodAccessorImpl.java:25)
	at java.lang.reflect.Method.invoke(Method.java:585)
	at org.apache.maven.surefire.booter.SurefireBooter.runSuitesInProcess(SurefireBooter.java:345)
	at org.apache.maven.surefire.booter.SurefireBooter.main(SurefireBooter.java:1009)


  



Mime
View raw message