continuum-notifications mailing list archives

Site index · List index
Message view « Date » · « Thread »
Top « Date » · « Thread »
From "Continuum@vmbuild.apache.org" <contin...@apache.org>
Subject [continuum] BUILD FAILURE: Continuum - Continuum Webapp Test - Maven 2.0.9, Java 5
Date Sat, 18 Jul 2009 02:09:58 GMT
Online report : http://vmbuild.apache.org/continuum/buildResult.action?buildId=200791&projectId=2284

Build statistics:
  State: Failed
  Previous State: Failed
  Started at: Fri 17 Jul 2009 19:00:49 -0700
  Finished at: Fri 17 Jul 2009 19:09:38 -0700
  Total time: 8m 48s
  Build Trigger: Schedule
  Build Number: 1
  Exit code: 1
  Building machine hostname: vmbuild.apache.org
  Operating system : Linux(unknown)
  Java Home version : 
          java version "1.5.0_12"
          Java(TM) 2 Runtime Environment, Standard Edition (build 1.5.0_12-b04)
          Java HotSpot(TM) Client VM (build 1.5.0_12-b04, mixed mode, sharing)
        
  Builder version :
          Maven version: 2.0.9
          Java version: 1.5.0_12
          OS name: "linux" version: "2.6.24-23-server" arch: "i386" Family: "unix"
    
****************************************************************************
SCM Changes:
****************************************************************************
Changed: no author @ no date
Comment: no comment
Files changed:
  src/test/selenium-ide/check_menu_options.html ( no revision )
  src/test/selenium-ide/add_and_build_project.html ( no revision )
  src/test/selenium-ide/create_admin_user_and_general_configuration.html ( no revision )
  src/test/selenium-ide/continuum_failing_test_suite.html ( no revision )
  src/test/selenium-ide/add_and_edit_project_level_build_definition.html ( no revision )
  src/test/selenium-ide/add_duplicate_project_group.html ( no revision )
  src/test/selenium-ide/test_build_definition_templates.html ( no revision )
  src/test/selenium-ide/test_release_plugin_configuration.html ( no revision )
  src/test/selenium-ide/edit_project_group.html ( no revision )
  src/test/selenium-ide/continuum_test_suite.html ( no revision )
  src/test/selenium-ide/add_and_delete_user.html ( no revision )
  src/test/selenium-ide/add_and_delete_local_repo.html ( no revision )
  src/test/selenium-ide/test_shell_project.html ( no revision )
  src/test/selenium-ide/continuum_online_test_suite.html ( no revision )
  src/test/selenium-ide/add_and_delete_project_group.html ( no revision )
  src/test/selenium-ide/test_project_group_homepage_url.html ( no revision )
  src/test/java/org/apache/continuum/web/test/AboutTest.java ( no revision )
  src/test/testng/config/testng.xml ( no revision )
  src/test/testng/org/apache/continuum/web/test/BuildAgentsTest.java ( no revision )
  src/test/testng/org/apache/continuum/web/test/XPathExpressionUtil.java ( no revision )
  src/test/testng/org/apache/continuum/web/test/LocalRepositoriesTest.java ( no revision )
  src/test/testng/org/apache/continuum/web/test/MyAccountTest.java ( no revision )
  src/test/testng/org/apache/continuum/web/test/ConfigurationTest.java ( no revision )
  src/test/testng/org/apache/continuum/web/test/BuildDefinitionTest.java ( no revision )
  src/test/testng/org/apache/continuum/web/test/LoginTest.java ( no revision )
  src/test/testng/org/apache/continuum/web/test/parent/AbstractUserRolesManagementTest.java
( no revision )
  src/test/testng/org/apache/continuum/web/test/parent/AbstractBuildAgentsTest.java ( no revision
)
  src/test/testng/org/apache/continuum/web/test/parent/AbstractContinuumTest.java ( no revision
)
  src/test/testng/org/apache/continuum/web/test/parent/AbstractSeleniumTest.java ( no revision
)
  src/test/testng/org/apache/continuum/web/test/AboutTest.java ( no revision )
  src/test/testng/org/apache/continuum/web/test/NotifierTest.java ( no revision )
  src/test/testng/org/apache/continuum/web/test/UserRolesManagementTest.java ( no revision
)
  src/test/testng/org/apache/continuum/web/test/PurgeTest.java ( no revision )
  src/test/testng/org/apache/continuum/web/test/ProjectGroupTest.java ( no revision )
  src/test/testng/org/apache/continuum/web/test/QueueTest.java ( no revision )
  src/test/testng/org/apache/continuum/web/test/MavenTwoProjectTest.java ( no revision )
  src/test/testng/org/apache/continuum/web/test/ScheduleTest.java ( no revision )
  src/test/tomcat5x/context.xml ( no revision )
  src/test/tomcat5x/conf/catalina.policy ( no revision )
  src/test/resources/testng.properties ( no revision )
  src/test/resources/it.properties ( no revision )
  src/site/apt/index.apt ( no revision )
  pom.xml ( no revision )

****************************************************************************
Dependencies Changes:
****************************************************************************
No dependencies changed


****************************************************************************
Build Definition:
****************************************************************************
POM filename: pom.xml
Goals: clean install   
Arguments: --batch-mode --non-recursive -U -P headless
Build Fresh: false
Always Build: false
Default Build Definition: true
Schedule: DEFAULT_SCHEDULE
Profile Name: Maven 2.0.9, Java 5
Description: Maven 2.0.9, Java 5

****************************************************************************
Test Summary:
****************************************************************************
Tests: 183
Failures: 2
Errors: 0
Success Rate: 98
Total time: 211.302

****************************************************************************
Test Failures:
****************************************************************************

TestSuite
    initializeContinuum :
  java.lang.RuntimeException
  java.lang.RuntimeException: Could not start Selenium session: Failed to start new browser
session: Error while launching browser
	at com.thoughtworks.selenium.DefaultSelenium.start(DefaultSelenium.java:89)
	at org.apache.continuum.web.test.parent.AbstractSeleniumTest.open(AbstractSeleniumTest.java:80)
	at org.apache.continuum.web.test.SetupSelenium.initializeContinuum(SetupSelenium.java:63)
Caused by: com.thoughtworks.selenium.SeleniumException: Failed to start new browser session:
Error while launching browser
	at com.thoughtworks.selenium.HttpCommandProcessor.throwAssertionFailureExceptionOrError(HttpCommandProcessor.java:97)
	at com.thoughtworks.selenium.HttpCommandProcessor.doCommand(HttpCommandProcessor.java:91)
	at com.thoughtworks.selenium.HttpCommandProcessor.getString(HttpCommandProcessor.java:262)
	at com.thoughtworks.selenium.HttpCommandProcessor.start(HttpCommandProcessor.java:223)
	at com.thoughtworks.selenium.DefaultSelenium.start(DefaultSelenium.java:81)
	... 28 more

    initializeContinuum :
  java.lang.RuntimeException
  java.lang.RuntimeException: Could not start Selenium session: Failed to start new browser
session: Error while launching browser
	at com.thoughtworks.selenium.DefaultSelenium.start(DefaultSelenium.java:89)
	at org.apache.continuum.web.test.parent.AbstractSeleniumTest.open(AbstractSeleniumTest.java:80)
	at org.apache.continuum.web.test.SetupSelenium.initializeContinuum(SetupSelenium.java:63)
Caused by: com.thoughtworks.selenium.SeleniumException: Failed to start new browser session:
Error while launching browser
	at com.thoughtworks.selenium.HttpCommandProcessor.throwAssertionFailureExceptionOrError(HttpCommandProcessor.java:97)
	at com.thoughtworks.selenium.HttpCommandProcessor.doCommand(HttpCommandProcessor.java:91)
	at com.thoughtworks.selenium.HttpCommandProcessor.getString(HttpCommandProcessor.java:262)
	at com.thoughtworks.selenium.HttpCommandProcessor.start(HttpCommandProcessor.java:223)
	at com.thoughtworks.selenium.DefaultSelenium.start(DefaultSelenium.java:81)
	... 28 more


  



Mime
View raw message