continuum-notifications mailing list archives

Site index · List index
Message view « Date » · « Thread »
Top « Date » · « Thread »
From "Continuum@vmbuild.apache.org" <contin...@apache.org>
Subject [continuum] BUILD FAILURE: Continuum - Continuum Webapp Test - Maven 2.0.9, Java 5
Date Wed, 08 Jul 2009 03:43:04 GMT
Online report : http://vmbuild.apache.org/continuum/buildResult.action?buildId=198376&projectId=2284

Build statistics:
  State: Failed
  Previous State: Ok
  Started at: Tue 7 Jul 2009 19:34:13 -0700
  Finished at: Tue 7 Jul 2009 20:42:44 -0700
  Total time: 1h 8m 30s
  Build Trigger: Schedule
  Build Number: 1
  Exit code: 1
  Building machine hostname: vmbuild.apache.org
  Operating system : Linux(unknown)
  Java Home version : 
          java version "1.5.0_12"
          Java(TM) 2 Runtime Environment, Standard Edition (build 1.5.0_12-b04)
          Java HotSpot(TM) Client VM (build 1.5.0_12-b04, mixed mode, sharing)
        
  Builder version :
          Maven version: 2.0.9
          Java version: 1.5.0_12
          OS name: "linux" version: "2.6.24-23-server" arch: "i386" Family: "unix"
    
****************************************************************************
SCM Changes:
****************************************************************************
No files changed

****************************************************************************
Dependencies Changes:
****************************************************************************
org.apache.continuum:continuum-webapp:1.4.0-SNAPSHOT


****************************************************************************
Build Definition:
****************************************************************************
POM filename: pom.xml
Goals: clean install   
Arguments: --batch-mode --non-recursive -U -P headless
Build Fresh: false
Always Build: false
Default Build Definition: true
Schedule: DEFAULT_SCHEDULE
Profile Name: Maven 2.0.9, Java 5
Description: Maven 2.0.9, Java 5

****************************************************************************
Test Summary:
****************************************************************************
Tests: 178
Failures: 2
Errors: 0
Success Rate: 98
Total time: 3949.557

****************************************************************************
Test Failures:
****************************************************************************

TestSuite
    testAddInvalidSchedule :
  java.lang.AssertionError
  java.lang.AssertionError: 'availableBuildQueues' isn't present. expected:<true> but
was:<false>
	at org.testng.Assert.fail(Assert.java:84)
	at org.testng.Assert.failNotEquals(Assert.java:438)
	at org.testng.Assert.assertTrue(Assert.java:32)
	at org.apache.continuum.web.test.parent.AbstractSeleniumTest.assertElementPresent(AbstractSeleniumTest.java:177)
	at org.apache.continuum.web.test.parent.AbstractScheduleTest.assertAddSchedulePage(AbstractScheduleTest.java:87)
	at org.apache.continuum.web.test.parent.AbstractScheduleTest.goToAddSchedule(AbstractScheduleTest.java:40)
	at org.apache.continuum.web.test.ScheduleTest.testAddInvalidSchedule(ScheduleTest.java:54)


    testAddSchedule :
  java.lang.AssertionError
  java.lang.AssertionError: 'availableBuildQueues' isn't present. expected:<true> but
was:<false>
	at org.testng.Assert.fail(Assert.java:84)
	at org.testng.Assert.failNotEquals(Assert.java:438)
	at org.testng.Assert.assertTrue(Assert.java:32)
	at org.apache.continuum.web.test.parent.AbstractSeleniumTest.assertElementPresent(AbstractSeleniumTest.java:177)
	at org.apache.continuum.web.test.parent.AbstractScheduleTest.assertAddSchedulePage(AbstractScheduleTest.java:87)
	at org.apache.continuum.web.test.parent.AbstractScheduleTest.goToAddSchedule(AbstractScheduleTest.java:40)
	at org.apache.continuum.web.test.ScheduleTest.testAddSchedule(ScheduleTest.java:46)


  



Mime
View raw message