continuum-notifications mailing list archives: May 2009

Site index · List index
Message list1 · 2 · 3 · Next »Thread · Author · Date
[continuum] BUILD FAILURE: Continuum - Continuum Webapp Test - Maven 2.0.9, Java 5
Contin...@vmbuild.apache.org   [continuum] BUILD FAILURE: Continuum - Continuum Webapp Test - Maven 2.0.9, Java 5 Wed, 13 May, 21:44
Contin...@vmbuild.apache.org   [continuum] BUILD FAILURE: Continuum - Continuum Webapp Test - Maven 2.0.9, Java 5 Wed, 13 May, 22:11
Contin...@vmbuild.apache.org   [continuum] BUILD FAILURE: Continuum - Continuum Webapp Test - Maven 2.0.9, Java 5 Wed, 13 May, 22:21
Contin...@vmbuild.apache.org   [continuum] BUILD FAILURE: Continuum - Continuum Webapp Test - Maven 2.0.9, Java 5 Thu, 14 May, 21:55
Contin...@vmbuild.apache.org   [continuum] BUILD FAILURE: Continuum - Continuum Webapp Test - Maven 2.0.9, Java 5 Sat, 16 May, 15:50
Contin...@vmbuild.apache.org   [continuum] BUILD FAILURE: Continuum - Continuum Webapp Test - Maven 2.0.9, Java 5 Mon, 18 May, 05:25
Contin...@vmbuild.apache.org   [continuum] BUILD FAILURE: Continuum - Continuum Webapp Test - Maven 2.0.9, Java 5 Mon, 18 May, 17:32
Contin...@vmbuild.apache.org   [continuum] BUILD FAILURE: Continuum - Continuum Webapp Test - Maven 2.0.9, Java 5 Tue, 19 May, 01:27
Contin...@vmbuild.apache.org   [continuum] BUILD FAILURE: Continuum - Continuum Webapp Test - Maven 2.0.9, Java 5 Tue, 19 May, 21:24
Contin...@vmbuild.apache.org   [continuum] BUILD FAILURE: Continuum - Continuum Webapp Test - Maven 2.0.9, Java 5 Wed, 20 May, 17:29
Contin...@vmbuild.apache.org   [continuum] BUILD FAILURE: Continuum - Continuum Webapp Test - Maven 2.0.9, Java 5 Thu, 21 May, 02:53
Contin...@vmbuild.apache.org [continuum] BUILD SUCCESSFUL: Continuum 1.3.x Branch - Continuum :: Project - default maven2 buildDefinition Wed, 13 May, 23:07
Contin...@vmbuild.apache.org [continuum] BUILD SUCCESSFUL: Continuum 1.3.x Branch - Continuum :: Model - default maven2 buildDefinition Wed, 13 May, 23:08
Contin...@vmbuild.apache.org [continuum] BUILD SUCCESSFUL: Continuum 1.3.x Branch - Continuum :: API - default maven2 buildDefinition Wed, 13 May, 23:09
Contin...@vmbuild.apache.org [continuum] BUILD SUCCESSFUL: Continuum 1.3.x Branch - Continuum :: Store - default maven2 buildDefinition Wed, 13 May, 23:13
[continuum] BUILD SUCCESSFUL: Continuum 1.3.x Branch - Continuum :: Notifiers - default maven2 buildDefinition
Contin...@vmbuild.apache.org   [continuum] BUILD SUCCESSFUL: Continuum 1.3.x Branch - Continuum :: Notifiers - default maven2 buildDefinition Wed, 13 May, 23:13
Contin...@vmbuild.apache.org   [continuum] BUILD SUCCESSFUL: Continuum 1.3.x Branch - Continuum :: Notifiers - default maven2 buildDefinition Fri, 22 May, 09:16
[continuum] BUILD SUCCESSFUL: Continuum 1.3.x Branch - Continuum :: Reports - default maven2 buildDefinition
Contin...@vmbuild.apache.org   [continuum] BUILD SUCCESSFUL: Continuum 1.3.x Branch - Continuum :: Reports - default maven2 buildDefinition Wed, 13 May, 23:15
Contin...@vmbuild.apache.org   [continuum] BUILD SUCCESSFUL: Continuum 1.3.x Branch - Continuum :: Reports - default maven2 buildDefinition Mon, 18 May, 15:18
[continuum] BUILD SUCCESSFUL: Continuum 1.3.x Branch - Continuum :: Commons - default maven2 buildDefinition
Contin...@vmbuild.apache.org   [continuum] BUILD SUCCESSFUL: Continuum 1.3.x Branch - Continuum :: Commons - default maven2 buildDefinition Wed, 13 May, 23:19
Contin...@vmbuild.apache.org   [continuum] BUILD SUCCESSFUL: Continuum 1.3.x Branch - Continuum :: Commons - default maven2 buildDefinition Sun, 17 May, 18:09
Contin...@vmbuild.apache.org   [continuum] BUILD SUCCESSFUL: Continuum 1.3.x Branch - Continuum :: Commons - default maven2 buildDefinition Sat, 30 May, 16:23
[continuum] BUILD SUCCESSFUL: Continuum 1.3.x Branch - Continuum :: Release System - default maven2 buildDefinition
Contin...@vmbuild.apache.org   [continuum] BUILD SUCCESSFUL: Continuum 1.3.x Branch - Continuum :: Release System - default maven2 buildDefinition Thu, 14 May, 00:06
Contin...@vmbuild.apache.org   [continuum] BUILD SUCCESSFUL: Continuum 1.3.x Branch - Continuum :: Release System - default maven2 buildDefinition Sun, 17 May, 19:08
Contin...@vmbuild.apache.org   [continuum] BUILD SUCCESSFUL: Continuum 1.3.x Branch - Continuum :: Release System - default maven2 buildDefinition Mon, 18 May, 15:20
Contin...@vmbuild.apache.org   [continuum] BUILD SUCCESSFUL: Continuum 1.3.x Branch - Continuum :: Release System - default maven2 buildDefinition Thu, 21 May, 02:15
Contin...@vmbuild.apache.org   [continuum] BUILD SUCCESSFUL: Continuum 1.3.x Branch - Continuum :: Release System - default maven2 buildDefinition Sun, 24 May, 12:21
Contin...@vmbuild.apache.org   [continuum] BUILD SUCCESSFUL: Continuum 1.3.x Branch - Continuum :: Release System - default maven2 buildDefinition Fri, 29 May, 18:13
[continuum] BUILD SUCCESSFUL: Continuum 1.3.x Branch - Continuum :: SCM - default maven2 buildDefinition
Contin...@vmbuild.apache.org   [continuum] BUILD SUCCESSFUL: Continuum 1.3.x Branch - Continuum :: SCM - default maven2 buildDefinition Thu, 14 May, 00:07
Contin...@vmbuild.apache.org   [continuum] BUILD SUCCESSFUL: Continuum 1.3.x Branch - Continuum :: SCM - default maven2 buildDefinition Sat, 30 May, 10:19
[continuum] BUILD SUCCESSFUL: Continuum 1.3.x Branch - Continuum :: Purge System - default maven2 buildDefinition
Contin...@vmbuild.apache.org   [continuum] BUILD SUCCESSFUL: Continuum 1.3.x Branch - Continuum :: Purge System - default maven2 buildDefinition Thu, 14 May, 00:09
Contin...@vmbuild.apache.org   [continuum] BUILD SUCCESSFUL: Continuum 1.3.x Branch - Continuum :: Purge System - default maven2 buildDefinition Mon, 18 May, 15:23
Contin...@vmbuild.apache.org   [continuum] BUILD SUCCESSFUL: Continuum 1.3.x Branch - Continuum :: Purge System - default maven2 buildDefinition Wed, 27 May, 23:18
Contin...@vmbuild.apache.org   [continuum] BUILD SUCCESSFUL: Continuum 1.3.x Branch - Continuum :: Purge System - default maven2 buildDefinition Sat, 30 May, 17:21
Contin...@vmbuild.apache.org [continuum] BUILD SUCCESSFUL: Continuum 1.3.x Branch - Continuum :: Distributed Build :: Transport - default maven2 buildDefinition Thu, 14 May, 00:10
[continuum] BUILD SUCCESSFUL: Continuum 1.3.x Branch - Continuum :: Distributed Build :: Transport :: Slave - default maven2 buildDefinition
Contin...@vmbuild.apache.org   [continuum] BUILD SUCCESSFUL: Continuum 1.3.x Branch - Continuum :: Distributed Build :: Transport :: Slave - default maven2 buildDefinition Thu, 14 May, 00:10
Contin...@vmbuild.apache.org   [continuum] BUILD SUCCESSFUL: Continuum 1.3.x Branch - Continuum :: Distributed Build :: Transport :: Slave - default maven2 buildDefinition Wed, 27 May, 19:14
Contin...@vmbuild.apache.org [continuum] BUILD SUCCESSFUL: Continuum 1.3.x Branch - Continuum :: Distributed Build :: Transport :: Slave :: API - default maven2 buildDefinition Thu, 14 May, 00:11
Contin...@vmbuild.apache.org [continuum] BUILD SUCCESSFUL: Continuum 1.3.x Branch - Continuum :: Distributed Build :: Transport :: Slave :: Client - default maven2 buildDefinition Thu, 14 May, 00:12
Contin...@vmbuild.apache.org [continuum] BUILD SUCCESSFUL: Continuum 1.3.x Branch - Continuum :: Builder - default maven2 buildDefinition Thu, 14 May, 00:13
Contin...@vmbuild.apache.org [continuum] BUILD SUCCESSFUL: Continuum 1.3.x Branch - Continuum :: Security - default maven2 buildDefinition Thu, 14 May, 00:14
[continuum] BUILD SUCCESSFUL: Continuum 1.3.x Branch - Continuum :: Core - default maven2 buildDefinition
Contin...@vmbuild.apache.org   [continuum] BUILD SUCCESSFUL: Continuum 1.3.x Branch - Continuum :: Core - default maven2 buildDefinition Thu, 14 May, 00:25
Contin...@vmbuild.apache.org   [continuum] BUILD SUCCESSFUL: Continuum 1.3.x Branch - Continuum :: Core - default maven2 buildDefinition Tue, 19 May, 16:39
Contin...@vmbuild.apache.org   [continuum] BUILD SUCCESSFUL: Continuum 1.3.x Branch - Continuum :: Core - default maven2 buildDefinition Wed, 20 May, 03:18
Contin...@vmbuild.apache.org   [continuum] BUILD SUCCESSFUL: Continuum 1.3.x Branch - Continuum :: Core - default maven2 buildDefinition Thu, 21 May, 03:25
Contin...@vmbuild.apache.org   [continuum] BUILD SUCCESSFUL: Continuum 1.3.x Branch - Continuum :: Core - default maven2 buildDefinition Sun, 24 May, 13:29
Contin...@vmbuild.apache.org   [continuum] BUILD SUCCESSFUL: Continuum 1.3.x Branch - Continuum :: Core - default maven2 buildDefinition Fri, 29 May, 19:22
Contin...@vmbuild.apache.org   [continuum] BUILD SUCCESSFUL: Continuum 1.3.x Branch - Continuum :: Core - default maven2 buildDefinition Sat, 30 May, 18:29
[continuum] BUILD SUCCESSFUL: Continuum 1.3.x Branch - Continuum :: IRC Notifier - default maven2 buildDefinition
Contin...@vmbuild.apache.org   [continuum] BUILD SUCCESSFUL: Continuum 1.3.x Branch - Continuum :: IRC Notifier - default maven2 buildDefinition Thu, 14 May, 00:26
Contin...@vmbuild.apache.org   [continuum] BUILD SUCCESSFUL: Continuum 1.3.x Branch - Continuum :: IRC Notifier - default maven2 buildDefinition Mon, 18 May, 15:25
Contin...@vmbuild.apache.org   [continuum] BUILD SUCCESSFUL: Continuum 1.3.x Branch - Continuum :: IRC Notifier - default maven2 buildDefinition Thu, 28 May, 02:24
[continuum] BUILD SUCCESSFUL: Continuum 1.3.x Branch - Continuum :: Jabber Notifier - default maven2 buildDefinition
Contin...@vmbuild.apache.org   [continuum] BUILD SUCCESSFUL: Continuum 1.3.x Branch - Continuum :: Jabber Notifier - default maven2 buildDefinition Thu, 14 May, 00:27
Contin...@vmbuild.apache.org   [continuum] BUILD SUCCESSFUL: Continuum 1.3.x Branch - Continuum :: Jabber Notifier - default maven2 buildDefinition Mon, 18 May, 15:26
[continuum] BUILD SUCCESSFUL: Continuum 1.3.x Branch - Continuum :: MSN Notifier - default maven2 buildDefinition
Contin...@vmbuild.apache.org   [continuum] BUILD SUCCESSFUL: Continuum 1.3.x Branch - Continuum :: MSN Notifier - default maven2 buildDefinition Thu, 14 May, 00:28
Contin...@vmbuild.apache.org   [continuum] BUILD SUCCESSFUL: Continuum 1.3.x Branch - Continuum :: MSN Notifier - default maven2 buildDefinition Mon, 18 May, 15:27
Contin...@vmbuild.apache.org   [continuum] BUILD SUCCESSFUL: Continuum 1.3.x Branch - Continuum :: MSN Notifier - default maven2 buildDefinition Fri, 29 May, 22:17
Contin...@vmbuild.apache.org   [continuum] BUILD SUCCESSFUL: Continuum 1.3.x Branch - Continuum :: MSN Notifier - default maven2 buildDefinition Sat, 30 May, 19:16
[continuum] BUILD SUCCESSFUL: Continuum 1.3.x Branch - Continuum :: Wagon Notifier - default maven2 buildDefinition
Contin...@vmbuild.apache.org   [continuum] BUILD SUCCESSFUL: Continuum 1.3.x Branch - Continuum :: Wagon Notifier - default maven2 buildDefinition Thu, 14 May, 00:29
Contin...@vmbuild.apache.org   [continuum] BUILD SUCCESSFUL: Continuum 1.3.x Branch - Continuum :: Wagon Notifier - default maven2 buildDefinition Mon, 18 May, 15:29
Contin...@vmbuild.apache.org   [continuum] BUILD SUCCESSFUL: Continuum 1.3.x Branch - Continuum :: Wagon Notifier - default maven2 buildDefinition Thu, 21 May, 04:17
Contin...@vmbuild.apache.org   [continuum] BUILD SUCCESSFUL: Continuum 1.3.x Branch - Continuum :: Wagon Notifier - default maven2 buildDefinition Fri, 22 May, 18:22
Contin...@vmbuild.apache.org   [continuum] BUILD SUCCESSFUL: Continuum 1.3.x Branch - Continuum :: Wagon Notifier - default maven2 buildDefinition Fri, 29 May, 23:16
Contin...@vmbuild.apache.org [continuum] BUILD SUCCESSFUL: Continuum 1.3.x Branch - Continuum :: XMLRPC :: Parent - default maven2 buildDefinition Thu, 14 May, 00:29
Contin...@vmbuild.apache.org [continuum] BUILD SUCCESSFUL: Continuum 1.3.x Branch - Continuum :: XMLRPC :: API - default maven2 buildDefinition Thu, 14 May, 00:30
[continuum] BUILD SUCCESSFUL: Continuum 1.3.x Branch - Continuum :: XMLRPC :: Server - default maven2 buildDefinition
Contin...@vmbuild.apache.org   [continuum] BUILD SUCCESSFUL: Continuum 1.3.x Branch - Continuum :: XMLRPC :: Server - default maven2 buildDefinition Thu, 14 May, 00:31
Contin...@vmbuild.apache.org   [continuum] BUILD SUCCESSFUL: Continuum 1.3.x Branch - Continuum :: XMLRPC :: Server - default maven2 buildDefinition Mon, 18 May, 15:30
Contin...@vmbuild.apache.org   [continuum] BUILD SUCCESSFUL: Continuum 1.3.x Branch - Continuum :: XMLRPC :: Server - default maven2 buildDefinition Tue, 19 May, 17:07
Contin...@vmbuild.apache.org [continuum] BUILD SUCCESSFUL: Continuum 1.3.x Branch - Continuum :: Distributed Build :: Transport :: Master - default maven2 buildDefinition Thu, 14 May, 00:32
[continuum] BUILD SUCCESSFUL: Continuum 1.3.x Branch - Continuum :: Distributed Build :: Transport :: Master :: API - default maven2 buildDefinition
Contin...@vmbuild.apache.org   [continuum] BUILD SUCCESSFUL: Continuum 1.3.x Branch - Continuum :: Distributed Build :: Transport :: Master :: API - default maven2 buildDefinition Thu, 14 May, 00:32
Contin...@vmbuild.apache.org   [continuum] BUILD SUCCESSFUL: Continuum 1.3.x Branch - Continuum :: Distributed Build :: Transport :: Master :: API - default maven2 buildDefinition Sat, 30 May, 20:20
[continuum] BUILD SUCCESSFUL: Continuum 1.3.x Branch - Continuum :: Distributed Build :: Transport :: Master :: Server - default maven2 buildDefinition
Contin...@vmbuild.apache.org   [continuum] BUILD SUCCESSFUL: Continuum 1.3.x Branch - Continuum :: Distributed Build :: Transport :: Master :: Server - default maven2 buildDefinition Thu, 14 May, 00:33
Contin...@vmbuild.apache.org   [continuum] BUILD SUCCESSFUL: Continuum 1.3.x Branch - Continuum :: Distributed Build :: Transport :: Master :: Server - default maven2 buildDefinition Mon, 18 May, 15:31
[continuum] BUILD SUCCESSFUL: Continuum 1.3.x Branch - Continuum :: Web APP - default maven2 buildDefinition
Contin...@vmbuild.apache.org   [continuum] BUILD SUCCESSFUL: Continuum 1.3.x Branch - Continuum :: Web APP - default maven2 buildDefinition Thu, 14 May, 00:36
Contin...@vmbuild.apache.org   [continuum] BUILD SUCCESSFUL: Continuum 1.3.x Branch - Continuum :: Web APP - default maven2 buildDefinition Mon, 18 May, 15:35
Contin...@vmbuild.apache.org   [continuum] BUILD SUCCESSFUL: Continuum 1.3.x Branch - Continuum :: Web APP - default maven2 buildDefinition Thu, 21 May, 09:24
Contin...@vmbuild.apache.org   [continuum] BUILD SUCCESSFUL: Continuum 1.3.x Branch - Continuum :: Web APP - default maven2 buildDefinition Sat, 23 May, 00:27
Contin...@vmbuild.apache.org   [continuum] BUILD SUCCESSFUL: Continuum 1.3.x Branch - Continuum :: Web APP - default maven2 buildDefinition Sat, 23 May, 04:22
Contin...@vmbuild.apache.org   [continuum] BUILD SUCCESSFUL: Continuum 1.3.x Branch - Continuum :: Web APP - default maven2 buildDefinition Sun, 24 May, 14:46
Contin...@vmbuild.apache.org   [continuum] BUILD SUCCESSFUL: Continuum 1.3.x Branch - Continuum :: Web APP - default maven2 buildDefinition Sat, 30 May, 21:25
[continuum] BUILD SUCCESSFUL: Continuum 1.3.x Branch - Apache Continuum - default maven2 buildDefinition
Contin...@vmbuild.apache.org   [continuum] BUILD SUCCESSFUL: Continuum 1.3.x Branch - Apache Continuum - default maven2 buildDefinition Thu, 14 May, 00:38
Contin...@vmbuild.apache.org   [continuum] BUILD SUCCESSFUL: Continuum 1.3.x Branch - Apache Continuum - default maven2 buildDefinition Sun, 24 May, 14:49
Contin...@vmbuild.apache.org [continuum] BUILD SUCCESSFUL: Continuum 1.3.x Branch - Continuum :: Distributed Build :: Build Agent - default maven2 buildDefinition Thu, 14 May, 00:38
Contin...@vmbuild.apache.org [continuum] BUILD SUCCESSFUL: Continuum 1.3.x Branch - Continuum :: Distributed Build :: Build Agent API - default maven2 buildDefinition Thu, 14 May, 00:39
[continuum] BUILD SUCCESSFUL: Continuum 1.3.x Branch - Continuum :: Distributed Build :: Transport :: Master :: Client - default maven2 buildDefinition
Contin...@vmbuild.apache.org   [continuum] BUILD SUCCESSFUL: Continuum 1.3.x Branch - Continuum :: Distributed Build :: Transport :: Master :: Client - default maven2 buildDefinition Thu, 14 May, 00:40
Contin...@vmbuild.apache.org   [continuum] BUILD SUCCESSFUL: Continuum 1.3.x Branch - Continuum :: Distributed Build :: Transport :: Master :: Client - default maven2 buildDefinition Sat, 30 May, 00:18
[continuum] BUILD SUCCESSFUL: Continuum 1.3.x Branch - Continuum :: Distributed Build :: Build Agent :: Core - default maven2 buildDefinition
Contin...@vmbuild.apache.org   [continuum] BUILD SUCCESSFUL: Continuum 1.3.x Branch - Continuum :: Distributed Build :: Build Agent :: Core - default maven2 buildDefinition Thu, 14 May, 01:08
Contin...@vmbuild.apache.org   [continuum] BUILD SUCCESSFUL: Continuum 1.3.x Branch - Continuum :: Distributed Build :: Build Agent :: Core - default maven2 buildDefinition Sun, 24 May, 14:55
[continuum] BUILD SUCCESSFUL: Continuum 1.3.x Branch - Continuum :: Distributed Build :: Transport :: Slave :: Server - default maven2 buildDefinition
Contin...@vmbuild.apache.org   [continuum] BUILD SUCCESSFUL: Continuum 1.3.x Branch - Continuum :: Distributed Build :: Transport :: Slave :: Server - default maven2 buildDefinition Thu, 14 May, 01:09
Contin...@vmbuild.apache.org   [continuum] BUILD SUCCESSFUL: Continuum 1.3.x Branch - Continuum :: Distributed Build :: Transport :: Slave :: Server - default maven2 buildDefinition Sun, 24 May, 14:57
Contin...@vmbuild.apache.org   [continuum] BUILD SUCCESSFUL: Continuum 1.3.x Branch - Continuum :: Distributed Build :: Transport :: Slave :: Server - default maven2 buildDefinition Sat, 30 May, 22:16
Contin...@vmbuild.apache.org [continuum] BUILD FAILURE: Continuum - Continuum :: Store - Maven 2.0.9, Java 5 Thu, 14 May, 01:13
[continuum] BUILD SUCCESSFUL: Continuum 1.3.x Branch - Continuum :: Data Management :: CLI - default maven2 buildDefinition
Contin...@vmbuild.apache.org   [continuum] BUILD SUCCESSFUL: Continuum 1.3.x Branch - Continuum :: Data Management :: CLI - default maven2 buildDefinition Thu, 14 May, 01:15
Contin...@vmbuild.apache.org   [continuum] BUILD SUCCESSFUL: Continuum 1.3.x Branch - Continuum :: Data Management :: CLI - default maven2 buildDefinition Thu, 28 May, 15:17
Contin...@vmbuild.apache.org [continuum] BUILD SUCCESSFUL: Continuum 1.3.x Branch - Continuum :: Data Management :: JDO - default maven2 buildDefinition Thu, 14 May, 01:18
Contin...@vmbuild.apache.org [continuum] BUILD SUCCESSFUL: Continuum 1.3.x Branch - Continuum :: Documentation - default maven2 buildDefinition Thu, 14 May, 01:22
[continuum] BUILD FAILURE: Continuum - Continuum :: Core - Maven 2.0.9, Java 5
Contin...@vmbuild.apache.org   [continuum] BUILD FAILURE: Continuum - Continuum :: Core - Maven 2.0.9, Java 5 Thu, 14 May, 01:22
Contin...@vmbuild.apache.org   [continuum] BUILD FAILURE: Continuum - Continuum :: Core - Maven 2.0.9, Java 5 Thu, 14 May, 22:21
Contin...@vmbuild.apache.org   [continuum] BUILD FAILURE: Continuum - Continuum :: Core - Maven 2.0.9, Java 5 Sun, 17 May, 21:17
Contin...@vmbuild.apache.org   [continuum] BUILD FAILURE: Continuum - Continuum :: Core - Maven 2.0.9, Java 5 Mon, 18 May, 15:34
Message list1 · 2 · 3 · Next »Thread · Author · Date
Box list
Dec 20145
Oct 20144
Jul 20142
Jun 20141
Apr 20141
Jan 201410
Sep 20132
Aug 20132
Apr 20131
Mar 20131
Feb 20131
Jan 201312
Dec 20127
Nov 201212
Oct 201210
Sep 20121
Aug 201214
Jul 20124
May 201281
Apr 20121
Mar 20121
Feb 20122
Jan 20123
Dec 20111
Sep 20113
Aug 201123
Jul 20118
Jun 20113
May 20114
Apr 20113
Mar 20112
Dec 20103
Nov 20103
Oct 20101
Aug 20108
Jul 201011
Jun 201048
May 201015
Apr 201011
Mar 2010598
Feb 201021
Jan 201056
Dec 20098
Nov 20094
Oct 200921
Sep 200924
Aug 2009335
Jul 200980
Jun 200944
May 2009170
Apr 2009266
Mar 2009202
Feb 2009226
Jan 2009193
Dec 200874
Nov 2008144
Oct 2008132
Sep 2008227
Aug 2008201
Jul 2008112
Jun 20086
May 2008215
Apr 2008253
Mar 200845