continuum-notifications mailing list archives

Site index · List index
Message view « Date » · « Thread »
Top « Date » · « Thread »
From "Continuum@vmbuild.apache.org" <contin...@apache.org>
Subject [continuum] BUILD FAILURE: Continuum - Continuum Webapp Test - Maven 2.0.9, Java 5
Date Wed, 13 May 2009 22:21:04 GMT
Online report : http://vmbuild.apache.org/continuum/buildResult.action?buildId=191185&projectId=2284

Build statistics:
  State: Failed
  Previous State: Failed
  Started at: Wed 13 May 2009 15:17:17 -0700
  Finished at: Wed 13 May 2009 15:21:01 -0700
  Total time: 3m 43s
  Build Trigger: Forced
  Build Number: 0
  Exit code: 1
  Building machine hostname: vmbuild.apache.org
  Operating system : Linux(unknown)
  Java Home version : 
          java version "1.5.0_12"
          Java(TM) 2 Runtime Environment, Standard Edition (build 1.5.0_12-b04)
          Java HotSpot(TM) Client VM (build 1.5.0_12-b04, mixed mode, sharing)
        
  Builder version :
          Maven version: 2.0.9
          Java version: 1.5.0_12
          OS name: "linux" version: "2.6.24-23-server" arch: "i386" Family: "unix"
    
****************************************************************************
SCM Changes:
****************************************************************************
Changed: wsmoak @ Wed 13 May 2009 15:16:51 -0700
Comment: [CONTINUUM-2073] Switch to OpenQA releases repo for vmbuild
Files changed:
  /continuum/trunk/continuum-webapp-test/pom.xml ( 774560 )

****************************************************************************
Dependencies Changes:
****************************************************************************
No dependencies changed


****************************************************************************
Build Definition:
****************************************************************************
POM filename: pom.xml
Goals: clean install   
Arguments: --batch-mode --non-recursive -U -P headless
Build Fresh: false
Always Build: false
Default Build Definition: true
Schedule: DEFAULT_SCHEDULE
Profile Name: Maven 2.0.9, Java 5
Description: Maven 2.0.9, Java 5

****************************************************************************
Test Summary:
****************************************************************************
Tests: 153
Failures: 1
Errors: 0
Success Rate: 99
Total time: 97.641

****************************************************************************
Test Failures:
****************************************************************************

TestSuite
    initializeContinuum :
  java.lang.AssertionError
  java.lang.AssertionError: 'Current User' isn't present. expected:<true> but was:<false>
	at org.testng.Assert.fail(Assert.java:84)
	at org.testng.Assert.failNotEquals(Assert.java:438)
	at org.testng.Assert.assertTrue(Assert.java:32)
	at org.apache.continuum.web.test.parent.AbstractSeleniumTest.assertTextPresent(AbstractSeleniumTest.java:125)
	at org.apache.continuum.web.test.parent.AbstractContinuumTest.assertAutenticatedPage(AbstractContinuumTest.java:129)
	at org.apache.continuum.web.test.AboutTest.initializeContinuum(AboutTest.java:54)

  



Mime
View raw message