continuum-notifications mailing list archives

Site index · List index
Message view « Date » · « Thread »
Top « Date » · « Thread »
From "Continuum@vmbuild.apache.org" <contin...@apache.org>
Subject [continuum] BUILD FAILURE: Continuum - Continuum Webapp Test - Maven 2.0.9, Java 5
Date Wed, 20 May 2009 17:29:48 GMT
Online report : http://vmbuild.apache.org/continuum/buildResult.action?buildId=192361&projectId=2284

Build statistics:
  State: Failed
  Previous State: Failed
  Started at: Wed 20 May 2009 10:23:43 -0700
  Finished at: Wed 20 May 2009 10:29:32 -0700
  Total time: 5m 48s
  Build Trigger: Schedule
  Build Number: 0
  Exit code: 1
  Building machine hostname: vmbuild.apache.org
  Operating system : Linux(unknown)
  Java Home version : 
          java version "1.5.0_12"
          Java(TM) 2 Runtime Environment, Standard Edition (build 1.5.0_12-b04)
          Java HotSpot(TM) Client VM (build 1.5.0_12-b04, mixed mode, sharing)
        
  Builder version :
          Maven version: 2.0.9
          Java version: 1.5.0_12
          OS name: "linux" version: "2.6.24-23-server" arch: "i386" Family: "unix"
    
****************************************************************************
SCM Changes:
****************************************************************************
No files changed

****************************************************************************
Dependencies Changes:
****************************************************************************
org.apache.continuum:continuum-webapp:1.4.0-SNAPSHOT


****************************************************************************
Build Definition:
****************************************************************************
POM filename: pom.xml
Goals: clean install   
Arguments: --batch-mode --non-recursive -U -P headless
Build Fresh: false
Always Build: false
Default Build Definition: true
Schedule: DEFAULT_SCHEDULE
Profile Name: Maven 2.0.9, Java 5
Description: Maven 2.0.9, Java 5

****************************************************************************
Test Summary:
****************************************************************************
Tests: 148
Failures: 6
Errors: 0
Success Rate: 95
Total time: 101.071

****************************************************************************
Test Failures:
****************************************************************************

TestSuite
    displayAboutPage :
  java.lang.AssertionError
  java.lang.AssertionError: expected:<Create Admin User> but was:<Continuum - About>
	at org.testng.Assert.fail(Assert.java:84)
	at org.testng.Assert.failNotEquals(Assert.java:438)
	at org.testng.Assert.assertEquals(Assert.java:108)
	at org.testng.Assert.assertEquals(Assert.java:129)
	at org.testng.Assert.assertEquals(Assert.java:139)
	at org.apache.continuum.web.test.AboutTest.displayAboutPage(AboutTest.java:90)

    testWithBadUsername :
  java.lang.AssertionError
  java.lang.AssertionError: expected:<Login Page> but was:<Create Admin User>
	at org.testng.Assert.fail(Assert.java:84)
	at org.testng.Assert.failNotEquals(Assert.java:438)
	at org.testng.Assert.assertEquals(Assert.java:108)
	at org.testng.Assert.assertEquals(Assert.java:129)
	at org.testng.Assert.assertEquals(Assert.java:139)
	at org.apache.continuum.web.test.parent.AbstractSeleniumTest.assertPage(AbstractSeleniumTest.java:110)
	at org.apache.continuum.web.test.parent.AbstractContinuumTest.assertLoginPage(AbstractContinuumTest.java:92)
	at org.apache.continuum.web.test.parent.AbstractContinuumTest.goToLoginPage(AbstractContinuumTest.java:87)
	at org.apache.continuum.web.test.LoginTest.testWithBadUsername(LoginTest.java:44)


    testWithBadPassword :
  java.lang.AssertionError
  java.lang.AssertionError: expected:<Login Page> but was:<Create Admin User>
	at org.testng.Assert.fail(Assert.java:84)
	at org.testng.Assert.failNotEquals(Assert.java:438)
	at org.testng.Assert.assertEquals(Assert.java:108)
	at org.testng.Assert.assertEquals(Assert.java:129)
	at org.testng.Assert.assertEquals(Assert.java:139)
	at org.apache.continuum.web.test.parent.AbstractSeleniumTest.assertPage(AbstractSeleniumTest.java:110)
	at org.apache.continuum.web.test.parent.AbstractContinuumTest.assertLoginPage(AbstractContinuumTest.java:92)
	at org.apache.continuum.web.test.parent.AbstractContinuumTest.goToLoginPage(AbstractContinuumTest.java:87)
	at org.apache.continuum.web.test.LoginTest.testWithBadPassword(LoginTest.java:55)


    testWithEmptyUsername :
  java.lang.AssertionError
  java.lang.AssertionError: expected:<Login Page> but was:<Create Admin User>
	at org.testng.Assert.fail(Assert.java:84)
	at org.testng.Assert.failNotEquals(Assert.java:438)
	at org.testng.Assert.assertEquals(Assert.java:108)
	at org.testng.Assert.assertEquals(Assert.java:129)
	at org.testng.Assert.assertEquals(Assert.java:139)
	at org.apache.continuum.web.test.parent.AbstractSeleniumTest.assertPage(AbstractSeleniumTest.java:110)
	at org.apache.continuum.web.test.parent.AbstractContinuumTest.assertLoginPage(AbstractContinuumTest.java:92)
	at org.apache.continuum.web.test.parent.AbstractContinuumTest.goToLoginPage(AbstractContinuumTest.java:87)
	at org.apache.continuum.web.test.LoginTest.testWithEmptyUsername(LoginTest.java:66)


    testWithEmptyPassword :
  java.lang.AssertionError
  java.lang.AssertionError: expected:<Login Page> but was:<Create Admin User>
	at org.testng.Assert.fail(Assert.java:84)
	at org.testng.Assert.failNotEquals(Assert.java:438)
	at org.testng.Assert.assertEquals(Assert.java:108)
	at org.testng.Assert.assertEquals(Assert.java:129)
	at org.testng.Assert.assertEquals(Assert.java:139)
	at org.apache.continuum.web.test.parent.AbstractSeleniumTest.assertPage(AbstractSeleniumTest.java:110)
	at org.apache.continuum.web.test.parent.AbstractContinuumTest.assertLoginPage(AbstractContinuumTest.java:92)
	at org.apache.continuum.web.test.parent.AbstractContinuumTest.goToLoginPage(AbstractContinuumTest.java:87)
	at org.apache.continuum.web.test.LoginTest.testWithEmptyPassword(LoginTest.java:76)


    testWithCorrectUsernamePassword :
  java.lang.AssertionError
  java.lang.AssertionError: expected:<Login Page> but was:<Create Admin User>
	at org.testng.Assert.fail(Assert.java:84)
	at org.testng.Assert.failNotEquals(Assert.java:438)
	at org.testng.Assert.assertEquals(Assert.java:108)
	at org.testng.Assert.assertEquals(Assert.java:129)
	at org.testng.Assert.assertEquals(Assert.java:139)
	at org.apache.continuum.web.test.parent.AbstractSeleniumTest.assertPage(AbstractSeleniumTest.java:110)
	at org.apache.continuum.web.test.parent.AbstractContinuumTest.assertLoginPage(AbstractContinuumTest.java:92)
	at org.apache.continuum.web.test.parent.AbstractContinuumTest.goToLoginPage(AbstractContinuumTest.java:87)
	at org.apache.continuum.web.test.LoginTest.testWithCorrectUsernamePassword(LoginTest.java:86)


  



Mime
View raw message