continuum-notifications mailing list archives

Site index · List index
Message view « Date » · « Thread »
Top « Date » · « Thread »
From "Continuum@vmbuild.apache.org" <contin...@apache.org>
Subject [continuum] BUILD FAILURE: Continuum - Continuum :: Release System - Maven 2.0.9, Java 5
Date Mon, 30 Mar 2009 14:20:32 GMT
Online report : http://vmbuild.apache.org/continuum/buildResult.action?buildId=177949&projectId=480

Build statistics:
  State: Failed
  Previous State: Failed
  Started at: Mon 30 Mar 2009 07:18:16 -0700
  Finished at: Mon 30 Mar 2009 07:20:17 -0700
  Total time: 2m 0s
  Build Trigger: Forced
  Build Number: 513
  Exit code: 1
  Building machine hostname: vmbuild.apache.org
  Operating system : Linux(unknown)
  Java Home version : 
          java version "1.5.0_12"
          Java(TM) 2 Runtime Environment, Standard Edition (build 1.5.0_12-b04)
          Java HotSpot(TM) Client VM (build 1.5.0_12-b04, mixed mode, sharing)
        
  Builder version :
          Maven version: 2.0.9
          Java version: 1.5.0_12
          OS name: "linux" version: "2.6.20-16-server" arch: "i386" Family: "unix"
    
****************************************************************************
SCM Changes:
****************************************************************************
No files changed

****************************************************************************
Dependencies Changes:
****************************************************************************
org.apache.continuum:continuum-api:1.3.3-SNAPSHOT

org.apache.continuum:continuum-test:1.3.3-SNAPSHOT

org.apache.continuum:continuum:1.3.3-SNAPSHOT


****************************************************************************
Build Definition:
****************************************************************************
POM filename: pom.xml
Goals: clean install   
Arguments: --batch-mode --non-recursive -U
Build Fresh: false
Always Build: false
Default Build Definition: true
Schedule: DEFAULT_SCHEDULE
Profile Name: Maven 2.0.9, Java 5
Description: Maven 2.0.9, Java 5

****************************************************************************
Test Summary:
****************************************************************************
Tests: 1
Failures: 1
Total time: 64.273

****************************************************************************
Test Failures:
****************************************************************************

ReleaseTaskExecutorTest
    testReleases :
  junit.framework.AssertionFailedError
  junit.framework.AssertionFailedError: Error in release:perform. Release output follows:
[ERROR] org.apache.maven.shared.release.ReleaseExecutionException: [INFO] Executing: /bin/sh
-c cd /home/continuum/data/working-directory/480/target/test-classes/build-dir &&
mvn -DperformRelease=true package --no-plugin-updates --batch-mode
	at org.apache.continuum.release.phase.AbstractContinuumRunGoalsPhase.execute(AbstractContinuumRunGoalsPhase.java:80)
	at org.apache.continuum.release.phase.RunPerformGoalsPhase.execute(RunPerformGoalsPhase.java:62)
	at org.apache.maven.shared.release.DefaultReleaseManager.perform(DefaultReleaseManager.java:319)
	at org.apache.maven.shared.release.DefaultReleaseManager.performWithResult(DefaultReleaseManager.java:279)
	at org.apache.maven.continuum.release.executors.PerformReleaseTaskExecutor.execute(PerformReleaseTaskExecutor.java:89)
	at org.apache.maven.continuum.release.executors.AbstractReleaseTaskExecutor.executeTask(AbstractReleaseTaskExecutor.java:68)
	at org.apache.maven.continuum.release.executors.ReleaseTaskExecutorTest.releaseSimpleProjectWithNextVersion(ReleaseTaskExecutorTest.java:170)
	at org.apache.maven.continuum.release.executors.ReleaseTaskExecutorTest.testReleases(ReleaseTaskExecutorTest.java:132)
Caused by: org.apache.maven.shared.release.exec.MavenExecutorException: Maven execution failed,
exit code: '127'
	at org.apache.continuum.utils.shell.DefaultShellCommandHelper.executeGoals(DefaultShellCommandHelper.java:216)
	at org.apache.continuum.utils.shell.DefaultShellCommandHelper.executeGoals(DefaultShellCommandHelper.java:171)
	at org.apache.continuum.release.phase.AbstractContinuumRunGoalsPhase.execute(AbstractContinuumRunGoalsPhase.java:72)
	... 33 more
	at junit.framework.Assert.fail(Assert.java:47)
	at org.apache.maven.continuum.release.executors.ReleaseTaskExecutorTest.releaseSimpleProjectWithNextVersion(ReleaseTaskExecutorTest.java:176)
	at org.apache.maven.continuum.release.executors.ReleaseTaskExecutorTest.testReleases(ReleaseTaskExecutorTest.java:132)
	at sun.reflect.NativeMethodAccessorImpl.invoke0(Native Method)
	at sun.reflect.NativeMethodAccessorImpl.invoke(NativeMethodAccessorImpl.java:39)
	at sun.reflect.DelegatingMethodAccessorImpl.invoke(DelegatingMethodAccessorImpl.java:25)
	at java.lang.reflect.Method.invoke(Method.java:585)
	at junit.framework.TestCase.runTest(TestCase.java:154)
	at junit.framework.TestCase.runBare(TestCase.java:127)
	at junit.framework.TestResult$1.protect(TestResult.java:106)
	at junit.framework.TestResult.runProtected(TestResult.java:124)
	at junit.framework.TestResult.run(TestResult.java:109)
	at junit.framework.TestCase.run(TestCase.java:118)
	at junit.framework.TestSuite.runTest(TestSuite.java:208)
	at junit.framework.TestSuite.run(TestSuite.java:203)
	at sun.reflect.NativeMethodAccessorImpl.invoke0(Native Method)
	at sun.reflect.NativeMethodAccessorImpl.invoke(NativeMethodAccessorImpl.java:39)
	at sun.reflect.DelegatingMethodAccessorImpl.invoke(DelegatingMethodAccessorImpl.java:25)
	at java.lang.reflect.Method.invoke(Method.java:585)
	at org.apache.maven.surefire.junit.JUnitTestSet.execute(JUnitTestSet.java:213)
	at org.apache.maven.surefire.suite.AbstractDirectoryTestSuite.executeTestSet(AbstractDirectoryTestSuite.java:140)
	at org.apache.maven.surefire.suite.AbstractDirectoryTestSuite.execute(AbstractDirectoryTestSuite.java:127)
	at org.apache.maven.surefire.Surefire.run(Surefire.java:177)
	at sun.reflect.NativeMethodAccessorImpl.invoke0(Native Method)
	at sun.reflect.NativeMethodAccessorImpl.invoke(NativeMethodAccessorImpl.java:39)
	at sun.reflect.DelegatingMethodAccessorImpl.invoke(DelegatingMethodAccessorImpl.java:25)
	at java.lang.reflect.Method.invoke(Method.java:585)
	at org.apache.maven.surefire.booter.SurefireBooter.runSuitesInProcess(SurefireBooter.java:345)
	at org.apache.maven.surefire.booter.SurefireBooter.main(SurefireBooter.java:1009)


  



Mime
View raw message