continuum-notifications mailing list archives

Site index · List index
Message view « Date » · « Thread »
Top « Date » · « Thread »
From Continuum VMBuild Server <contin...@apache.org>
Subject [continuum] BUILD SUCCESSFUL: Continuum Core
Date Thu, 01 May 2008 00:19:38 GMT
Online report : http://vmbuild.apache.org/continuum/buildResult.action?buildId=83905&projectId=463

Build statistics:
  State: Ok
  Previous State: Error
  Started at: Wed 30 Apr 2008 17:16:48 -0700
  Finished at: Wed 30 Apr 2008 17:19:28 -0700
  Total time: 2m 39s
  Build Trigger: Schedule
  Build Number: 55
  Exit code: 0
  Building machine hostname: vmbuild.apache.org
  Operating system : Linux(unknown)
  Java Home version : 
          java version "1.6.0_05"
          Java(TM) SE Runtime Environment (build 1.6.0_05-b13)
          Java HotSpot(TM) Client VM (build 10.0-b19, mixed mode, sharing)
        
  Builder version :
          Maven version: 2.0.7
          Java version: 1.6.0_05
          OS name: "linux" version: "2.6.20-16-server" arch: "i386"
    
****************************************************************************
SCM Changes:
****************************************************************************
Changed: no author @ no date
Comment: no comment
Files changed:
  src/test/java/org/apache/maven/continuum/execution/shell/ShellBuildExecutorTest.java ( no revision )
  src/test/java/org/apache/maven/continuum/core/action/CreateProjectsFromMetadataTest.java ( no revision )
  src/test/resources/log4j.xml ( no revision )
  src/main/java/org/apache/maven/continuum/execution/AbstractBuildExecutor.java ( no revision )
  src/main/java/org/apache/maven/continuum/execution/maven/m1/MavenOneBuildExecutor.java ( no revision )
  src/main/resources/META-INF/plexus/components.xml ( no revision )
  src/main/resources/META-INF/spring-context.xml ( no revision )

****************************************************************************
Dependencies Changes:
****************************************************************************
org.apache.continuum:continuum-reports:1.2-SNAPSHOT

org.apache.continuum:continuum-commons:1.2-SNAPSHOT

org.apache.continuum:continuum-security:1.2-SNAPSHOT

org.apache.continuum:continuum-api:1.2-SNAPSHOT

org.apache.continuum:continuum-release:1.2-SNAPSHOT

org.apache.continuum:continuum-test:1.2-SNAPSHOT

org.apache.continuum:continuum-notifier-api:1.2-SNAPSHOT

org.apache.continuum:continuum-store:1.2-SNAPSHOT

org.apache.continuum:continuum-configuration:1.2-SNAPSHOT

org.apache.continuum:continuum:1.2-SNAPSHOT


****************************************************************************
Build Defintion:
****************************************************************************
POM filename: pom.xml
Goals: clean install   
Arguments: --batch-mode --non-recursive
Build Fresh: false
Always Build: false
Default Build Definition: true
Schedule: DEFAULT_SCHEDULE
Description: $build.buildDefinition.description


****************************************************************************
Test Summary:
****************************************************************************
Tests: 63
Failures: 0
Total time: 130861

****************************************************************************
Output:
****************************************************************************
[INFO] Scanning for projects...
[INFO] ----------------------------------------------------------------------------
[INFO] Building Continuum Core
[INFO]    task-segment: [clean, install]
[INFO] ----------------------------------------------------------------------------
[INFO] [clean:clean]
[INFO] Deleting directory /home/continuum/data/working-directory/463/target
[INFO] Deleting directory /home/continuum/data/working-directory/463/target/classes
[INFO] Deleting directory /home/continuum/data/working-directory/463/target/test-classes
[INFO] Deleting directory /home/continuum/data/working-directory/463/target/site
[INFO] [buildnumber:create {execution: default}]
[INFO] Checking for local modifications: skipped.
[INFO] Updating project files from SCM: skipped.
[INFO] Storing buildNumber: 652411 at timestamp: 1209601018742
[INFO] [plexus:descriptor {execution: generate}]
[WARNING] Component: MavenTwoContinuumProjectBuilder, field name: 'excludedPackagingTypes': Currently configurable fields will not be written to the descriptor without a default value.
[INFO] Setting property: classpath.resource.loader.class => 'org.codehaus.plexus.velocity.ContextClassLoaderResourceLoader'.
[INFO] Setting property: velocimacro.messages.on => 'false'.
[INFO] Setting property: resource.loader => 'classpath'.
[INFO] Setting property: resource.manager.logwhenfound => 'false'.
[INFO] [remote-resources:process {execution: default}]
[INFO] [resources:resources]
[INFO] Using default encoding to copy filtered resources.
[INFO] [plexus:merge-descriptors {execution: merge}]
[INFO] [compiler:compile]
[INFO] Compiling 77 source files to /home/continuum/data/working-directory/463/target/classes
[INFO] [resources:testResources]
[INFO] Using default encoding to copy filtered resources.
[INFO] [compiler:testCompile]
[INFO] Compiling 21 source files to /home/continuum/data/working-directory/463/target/test-classes
[INFO] [surefire:test]
[INFO] Surefire report directory: /home/continuum/data/working-directory/463/target/surefire-reports

-------------------------------------------------------
 T E S T S
-------------------------------------------------------
Running org.apache.maven.continuum.notification.mail.MailContinuumNotifierTest
17:17:18,492 WARN  [PlexusLifecycleBeanPostProcessor.getLoggerManager](104) No loggerManager set in context. Falling back to ConsoleLoggerManager
[WARNING] Could not find the executable 'mvn' in the path '[]'.
[WARNING] Could not find the executable 'maven' in the path '[]'.
[WARNING] Could not find the executable 'ant' in the path '[]'.
17:17:20,180 WARN  [MetaData.warn](98) No manager for annotations was found in the CLASSPATH so all annotations are ignored.
17:17:20,932 WARN  [MetaData.warn](98) No manager for annotations was found in the CLASSPATH so all annotations are ignored.
[INFO] create default AntBuildDefinitionTemplate
[INFO] create Default Schedule
[INFO] create default MavenOneBuildDefinitionTemplate
[INFO] create default MavenTwoBuildDefinitionTemplate
[INFO] create default ShellBuildDefinitionTemplate
[INFO] Build executors:
[INFO]   shell
[INFO]   maven-1
[INFO]   ant
[INFO]   maven2
[INFO] Initializing Continuum.
[INFO] Showing all projects: 
[INFO] Starting Continuum.
[INFO] 
[INFO] 
[INFO] < Continuum unknown started! >
[INFO] ------------------------------
[INFO]        \   ^__^
[INFO]         \  (oo)\_______
[INFO]            (__)\       )\/\
[INFO]                ||----w |
[INFO]                ||     ||
[INFO] 
[INFO] 
[INFO] Continuum initializer running ...
[INFO] Default Project Group exists
[INFO] Continuum initializer end running ...
[INFO] Activating schedules ...
[INFO] DEFAULT_SCHEDULE: next fire time ->Wed Apr 30 18:00:00 PDT 2008
[INFO] Using 'continuum@localhost' as the from mailbox for all emails.
[INFO] From name: Continuum
[INFO] Build host name: vmbuild.apache.org
[INFO] Message Subject: '[continuum] BUILD SUCCESSFUL: foo.bar Test Project'.
[INFO] Sending message: From '"Continuum" <continuum@localhost>'.
[INFO] Recipient: To '<foo@bar>'.
Online report : /buildResult.action?buildId=17&projectId=0

Build statistics:
  State: Ok
  Previous Build: No previous build.
  Started at: Wed, 30 Apr 2008 17:17:21 -0700
  Finished at: Wed, 30 Apr 2008 17:37:56 -0700
  Total time: 20m 34s
  Build Trigger: Forced
  Build Number: 0
  Exit code: 10
  Building machine hostname: vmbuild.apache.org
  Operating system : Linux(unknown)
  Java Home version : 
          java version "1.6.0_05"
          Java(TM) SE Runtime Environment (build 1.6.0_05-b13)
          Java HotSpot(TM) Client VM (build 10.0-b19, mixed mode, sharing)
        
  Builder version :
          Maven version: 2.0.7
          Java version: 1.6.0_05
          OS name: "linux" version: "2.6.20-16-server" arch: "i386"
    
****************************************************************************
Dependencies Changes:
****************************************************************************
No dependencies changed



****************************************************************************
Test Summary:
****************************************************************************
Tests: 0
Failures: 0
Total time: 0.0




17:17:24,654 WARN  [PlexusLifecycleBeanPostProcessor.getLoggerManager](104) No loggerManager set in context. Falling back to ConsoleLoggerManager
[WARNING] Could not find the executable 'mvn' in the path '[]'.
[WARNING] Could not find the executable 'maven' in the path '[]'.
[WARNING] Could not find the executable 'ant' in the path '[]'.
17:17:25,062 WARN  [MetaData.warn](98) No manager for annotations was found in the CLASSPATH so all annotations are ignored.
17:17:25,551 WARN  [MetaData.warn](98) No manager for annotations was found in the CLASSPATH so all annotations are ignored.
[INFO] create default AntBuildDefinitionTemplate
[INFO] create Default Schedule
[INFO] create default MavenOneBuildDefinitionTemplate
[INFO] create default MavenTwoBuildDefinitionTemplate
[INFO] create default ShellBuildDefinitionTemplate
[INFO] Build executors:
[INFO]   shell
[INFO]   maven-1
[INFO]   ant
[INFO]   maven2
[INFO] Initializing Continuum.
[INFO] Showing all projects: 
[INFO] Starting Continuum.
[INFO] 
[INFO] 
[INFO] < Continuum unknown started! >
[INFO] ------------------------------
[INFO]        \   ^__^
[INFO]         \  (oo)\_______
[INFO]            (__)\       )\/\
[INFO]                ||----w |
[INFO]                ||     ||
[INFO] 
[INFO] 
[INFO] Continuum initializer running ...
[INFO] Default Project Group exists
[INFO] Continuum initializer end running ...
[INFO] Activating schedules ...
[WARNING] Will not schedule this job as a job {DEFAULT_SCHEDULE:DEFAULT} already exists.
[INFO] DEFAULT_SCHEDULE: next fire time ->null
[INFO] Using 'continuum@localhost' as the from mailbox for all emails.
[INFO] From name: Continuum
[INFO] Build host name: vmbuild.apache.org
[INFO] Message Subject: '[continuum] BUILD FAILURE: foo.bar Test Project'.
[INFO] Sending message: From '"Continuum" <continuum@localhost>'.
[INFO] Recipient: To '<foo@bar>'.
Online report : /buildResult.action?buildId=17&projectId=0

Build statistics:
  State: Failed
  Previous Build: No previous build.
  Started at: Wed, 30 Apr 2008 17:17:26 -0700
  Finished at: Wed, 30 Apr 2008 17:38:00 -0700
  Total time: 20m 34s
  Build Trigger: Forced
  Build Number: 0
  Exit code: 10
  Building machine hostname: vmbuild.apache.org
  Operating system : Linux(unknown)
  Java Home version : 
          java version "1.6.0_05"
          Java(TM) SE Runtime Environment (build 1.6.0_05-b13)
          Java HotSpot(TM) Client VM (build 10.0-b19, mixed mode, sharing)
        
  Builder version :
          Maven version: 2.0.7
          Java version: 1.6.0_05
          OS name: "linux" version: "2.6.20-16-server" arch: "i386"
    
****************************************************************************
Dependencies Changes:
****************************************************************************
No dependencies changed



****************************************************************************
Test Summary:
****************************************************************************
Tests: 0
Failures: 0
Total time: 0.0




17:17:27,781 WARN  [PlexusLifecycleBeanPostProcessor.getLoggerManager](104) No loggerManager set in context. Falling back to ConsoleLoggerManager
[WARNING] Could not find the executable 'mvn' in the path '[]'.
[WARNING] Could not find the executable 'maven' in the path '[]'.
[WARNING] Could not find the executable 'ant' in the path '[]'.
17:17:28,001 WARN  [MetaData.warn](98) No manager for annotations was found in the CLASSPATH so all annotations are ignored.
17:17:28,462 WARN  [MetaData.warn](98) No manager for annotations was found in the CLASSPATH so all annotations are ignored.
[INFO] create default AntBuildDefinitionTemplate
[INFO] create Default Schedule
[INFO] create default MavenOneBuildDefinitionTemplate
[INFO] create default MavenTwoBuildDefinitionTemplate
[INFO] create default ShellBuildDefinitionTemplate
[INFO] Build executors:
[INFO]   shell
[INFO]   maven-1
[INFO]   ant
[INFO]   maven2
[INFO] Initializing Continuum.
[INFO] Showing all projects: 
[INFO] Starting Continuum.
[INFO] 
[INFO] 
[INFO] < Continuum unknown started! >
[INFO] ------------------------------
[INFO]        \   ^__^
[INFO]         \  (oo)\_______
[INFO]            (__)\       )\/\
[INFO]                ||----w |
[INFO]                ||     ||
[INFO] 
[INFO] 
[INFO] Continuum initializer running ...
[INFO] Default Project Group exists
[INFO] Continuum initializer end running ...
[INFO] Activating schedules ...
[WARNING] Will not schedule this job as a job {DEFAULT_SCHEDULE:DEFAULT} already exists.
[INFO] DEFAULT_SCHEDULE: next fire time ->null
[INFO] Using 'continuum@localhost' as the from mailbox for all emails.
[INFO] From name: Continuum
[INFO] Build host name: vmbuild.apache.org
Online report : /buildResult.action?buildId=17&projectId=0

Build statistics:
  State: Error
  Previous Build: No previous build.
  Started at: Wed, 30 Apr 2008 17:17:28 -0700
  Finished at: Wed, 30 Apr 2008 17:38:03 -0700
  Total time: 20m 34s
  Build Trigger: Forced
  Build Number: 0
  Exit code: 10
  Building machine hostname: vmbuild.apache.org
  Operating system : Linux(unknown)
  Java Home version : 
          java version "1.6.0_05"
          Java(TM) SE Runtime Environment (build 1.6.0_05-b13)
          Java HotSpot(TM) Client VM (build 10.0-b19, mixed mode, sharing)
        
  Builder version :
          Maven version: 2.0.7
          Java version: 1.6.0_05
          OS name: "linux" version: "2.6.20-16-server" arch: "i386"
    
****************************************************************************
Dependencies Changes:
****************************************************************************
No dependencies changed



****************************************************************************
Test Summary:
****************************************************************************
Tests: 0
Failures: 0
Total time: 0.0

****************************************************************************
Build Error:
****************************************************************************
Big long error message




[INFO] Message Subject: '[continuum] BUILD ERROR: foo.bar Test Project'.
[INFO] Sending message: From '"Continuum" <continuum@localhost>'.
[INFO] Recipient: To '<foo@bar>'.
Tests run: 3, Failures: 0, Errors: 0, Skipped: 0, Time elapsed: 14.583 sec
Running org.apache.maven.continuum.utils.ProjectSorterTest
Tests run: 2, Failures: 0, Errors: 0, Skipped: 0, Time elapsed: 0.017 sec
Running org.apache.maven.continuum.execution.AbstractContinuumBuildExecutorTest
[INFO] Exit code: 0
Tests run: 1, Failures: 0, Errors: 0, Skipped: 0, Time elapsed: 0.156 sec
Running org.apache.maven.continuum.buildqueue.BuildQueueTest
17:17:31,018 WARN  [PlexusLifecycleBeanPostProcessor.getLoggerManager](104) No loggerManager set in context. Falling back to ConsoleLoggerManager
[WARNING] Could not find the executable 'mvn' in the path '[]'.
[WARNING] Could not find the executable 'maven' in the path '[]'.
[WARNING] Could not find the executable 'ant' in the path '[]'.
17:17:31,296 WARN  [MetaData.warn](98) No manager for annotations was found in the CLASSPATH so all annotations are ignored.
17:17:31,773 WARN  [MetaData.warn](98) No manager for annotations was found in the CLASSPATH so all annotations are ignored.
17:17:33,019 WARN  [PlexusLifecycleBeanPostProcessor.getLoggerManager](104) No loggerManager set in context. Falling back to ConsoleLoggerManager
[WARNING] Could not find the executable 'mvn' in the path '[]'.
[WARNING] Could not find the executable 'maven' in the path '[]'.
[WARNING] Could not find the executable 'ant' in the path '[]'.
17:17:33,233 WARN  [MetaData.warn](98) No manager for annotations was found in the CLASSPATH so all annotations are ignored.
17:17:33,656 WARN  [MetaData.warn](98) No manager for annotations was found in the CLASSPATH so all annotations are ignored.
17:17:34,906 WARN  [PlexusLifecycleBeanPostProcessor.getLoggerManager](104) No loggerManager set in context. Falling back to ConsoleLoggerManager
[WARNING] Could not find the executable 'mvn' in the path '[]'.
[WARNING] Could not find the executable 'maven' in the path '[]'.
[WARNING] Could not find the executable 'ant' in the path '[]'.
17:17:35,117 WARN  [MetaData.warn](98) No manager for annotations was found in the CLASSPATH so all annotations are ignored.
17:17:35,513 WARN  [MetaData.warn](98) No manager for annotations was found in the CLASSPATH so all annotations are ignored.
Tests run: 3, Failures: 0, Errors: 0, Skipped: 0, Time elapsed: 5.72 sec
Running org.apache.maven.continuum.TestAction
Tests run: 0, Failures: 0, Errors: 0, Skipped: 0, Time elapsed: 0.075 sec
Running org.apache.maven.continuum.project.builder.maven.MavenTwoContinuumProjectBuilderTest
17:17:36,475 WARN  [PlexusLifecycleBeanPostProcessor.getLoggerManager](104) No loggerManager set in context. Falling back to ConsoleLoggerManager
[WARNING] Could not find the executable 'mvn' in the path '[]'.
[WARNING] Could not find the executable 'maven' in the path '[]'.
[WARNING] Could not find the executable 'ant' in the path '[]'.
17:17:36,761 WARN  [MetaData.warn](98) No manager for annotations was found in the CLASSPATH so all annotations are ignored.
17:17:37,378 WARN  [MetaData.warn](98) No manager for annotations was found in the CLASSPATH so all annotations are ignored.
[INFO] create default AntBuildDefinitionTemplate
[INFO] create Default Schedule
[INFO] create default MavenOneBuildDefinitionTemplate
[INFO] create default MavenTwoBuildDefinitionTemplate
[INFO] create default ShellBuildDefinitionTemplate
[INFO] Downloading file:/home/continuum/data/working-directory/463/src/test/repository/maven-builder-helper-1.xml
17:17:39,482 WARN  [PlexusLifecycleBeanPostProcessor.getLoggerManager](104) No loggerManager set in context. Falling back to ConsoleLoggerManager
[WARNING] Could not find the executable 'mvn' in the path '[]'.
[WARNING] Could not find the executable 'maven' in the path '[]'.
[WARNING] Could not find the executable 'ant' in the path '[]'.
17:17:39,770 WARN  [MetaData.warn](98) No manager for annotations was found in the CLASSPATH so all annotations are ignored.
17:17:40,182 WARN  [MetaData.warn](98) No manager for annotations was found in the CLASSPATH so all annotations are ignored.
[INFO] create default AntBuildDefinitionTemplate
[INFO] create Default Schedule
[INFO] create default MavenOneBuildDefinitionTemplate
[INFO] create default MavenTwoBuildDefinitionTemplate
[INFO] create default ShellBuildDefinitionTemplate
[INFO] Downloading file:/home/continuum/data/working-directory/463/src/test/repository/maven-builder-helper-2.xml
17:17:42,125 WARN  [PlexusLifecycleBeanPostProcessor.getLoggerManager](104) No loggerManager set in context. Falling back to ConsoleLoggerManager
[WARNING] Could not find the executable 'mvn' in the path '[]'.
[WARNING] Could not find the executable 'maven' in the path '[]'.
[WARNING] Could not find the executable 'ant' in the path '[]'.
17:17:42,361 WARN  [MetaData.warn](98) No manager for annotations was found in the CLASSPATH so all annotations are ignored.
17:17:42,764 WARN  [MetaData.warn](98) No manager for annotations was found in the CLASSPATH so all annotations are ignored.
[INFO] create default AntBuildDefinitionTemplate
[INFO] create Default Schedule
[INFO] create default MavenOneBuildDefinitionTemplate
[INFO] create default MavenTwoBuildDefinitionTemplate
[INFO] create default ShellBuildDefinitionTemplate
[INFO] Downloading file:/home/continuum/data/working-directory/463/src/test/repository/maven-builder-helper-3.xml
17:17:44,470 WARN  [PlexusLifecycleBeanPostProcessor.getLoggerManager](104) No loggerManager set in context. Falling back to ConsoleLoggerManager
[WARNING] Could not find the executable 'mvn' in the path '[]'.
[WARNING] Could not find the executable 'maven' in the path '[]'.
[WARNING] Could not find the executable 'ant' in the path '[]'.
17:17:45,095 WARN  [MetaData.warn](98) No manager for annotations was found in the CLASSPATH so all annotations are ignored.
17:17:45,531 WARN  [MetaData.warn](98) No manager for annotations was found in the CLASSPATH so all annotations are ignored.
[INFO] create default AntBuildDefinitionTemplate
[INFO] create Default Schedule
[INFO] create default MavenOneBuildDefinitionTemplate
[INFO] create default MavenTwoBuildDefinitionTemplate
[INFO] create default ShellBuildDefinitionTemplate
[INFO] Downloading file:/home/continuum/data/working-directory/463/target/test-classes/projects/continuum/pom.xml
[INFO] Downloading file:/home/continuum/data/working-directory/463/target/test-classes/projects/continuum/continuum-core/pom.xml
[INFO] Downloading file:/home/continuum/data/working-directory/463/target/test-classes/projects/continuum/continuum-model/pom.xml
[INFO] Downloading file:/home/continuum/data/working-directory/463/target/test-classes/projects/continuum/continuum-plexus-application/pom.xml
[INFO] Downloading file:/home/continuum/data/working-directory/463/target/test-classes/projects/continuum/continuum-web/pom.xml
[INFO] Downloading file:/home/continuum/data/working-directory/463/target/test-classes/projects/continuum/continuum-xmlrpc/pom.xml
[INFO] Downloading file:/home/continuum/data/working-directory/463/target/test-classes/projects/continuum/continuum-notifiers/pom.xml
[INFO] Downloading file:/home/continuum/data/working-directory/463/target/test-classes/projects/continuum/continuum-notifiers/continuum-notifier-irc/pom.xml
[INFO] Downloading file:/home/continuum/data/working-directory/463/target/test-classes/projects/continuum/continuum-notifiers/continuum-notifier-jabber/pom.xml
[INFO] Downloading file:/home/continuum/data/working-directory/463/target/test-classes/projects/continuum/I'm-not-here-project/pom.xml
17:17:48,382 WARN  [PlexusLifecycleBeanPostProcessor.getLoggerManager](104) No loggerManager set in context. Falling back to ConsoleLoggerManager
[WARNING] Could not find the executable 'mvn' in the path '[]'.
[WARNING] Could not find the executable 'maven' in the path '[]'.
[WARNING] Could not find the executable 'ant' in the path '[]'.
17:17:48,718 WARN  [MetaData.warn](98) No manager for annotations was found in the CLASSPATH so all annotations are ignored.
17:17:49,138 WARN  [MetaData.warn](98) No manager for annotations was found in the CLASSPATH so all annotations are ignored.
[INFO] create default AntBuildDefinitionTemplate
[INFO] create Default Schedule
[INFO] create default MavenOneBuildDefinitionTemplate
[INFO] create default MavenTwoBuildDefinitionTemplate
[INFO] create default ShellBuildDefinitionTemplate
[INFO] Downloading file:/home/continuum/data/working-directory/463/target/test-classes/projects/continuum/pom_ci.xml
[INFO] Downloading file:/home/continuum/data/working-directory/463/target/test-classes/projects/continuum/continuum-core/pom.xml
[INFO] Downloading file:/home/continuum/data/working-directory/463/target/test-classes/projects/continuum/continuum-model/pom.xml
[INFO] Downloading file:/home/continuum/data/working-directory/463/target/test-classes/projects/continuum/continuum-plexus-application/pom.xml
[INFO] Downloading file:/home/continuum/data/working-directory/463/target/test-classes/projects/continuum/continuum-web/pom.xml
[INFO] Downloading file:/home/continuum/data/working-directory/463/target/test-classes/projects/continuum/continuum-xmlrpc/pom.xml
[INFO] Downloading file:/home/continuum/data/working-directory/463/target/test-classes/projects/continuum/continuum-notifiers/pom.xml
[INFO] Downloading file:/home/continuum/data/working-directory/463/target/test-classes/projects/continuum/continuum-notifiers/continuum-notifier-irc/pom.xml
[INFO] Downloading file:/home/continuum/data/working-directory/463/target/test-classes/projects/continuum/continuum-notifiers/continuum-notifier-jabber/pom.xml
[INFO] Downloading file:/home/continuum/data/working-directory/463/target/test-classes/projects/continuum/I'm-not-here-project/pom.xml
17:17:53,824 WARN  [PlexusLifecycleBeanPostProcessor.getLoggerManager](104) No loggerManager set in context. Falling back to ConsoleLoggerManager
[WARNING] Could not find the executable 'mvn' in the path '[]'.
[WARNING] Could not find the executable 'maven' in the path '[]'.
[WARNING] Could not find the executable 'ant' in the path '[]'.
17:17:54,452 WARN  [MetaData.warn](98) No manager for annotations was found in the CLASSPATH so all annotations are ignored.
17:17:54,893 WARN  [MetaData.warn](98) No manager for annotations was found in the CLASSPATH so all annotations are ignored.
[INFO] create default AntBuildDefinitionTemplate
[INFO] create Default Schedule
[INFO] create default MavenOneBuildDefinitionTemplate
[INFO] create default MavenTwoBuildDefinitionTemplate
[INFO] create default ShellBuildDefinitionTemplate
[INFO] Downloading file:/home/continuum/data/working-directory/463/target/test-classes/projects/continuum/continuum-core/pom.xml
Tests run: 6, Failures: 0, Errors: 0, Skipped: 0, Time elapsed: 19.852 sec
Running org.apache.maven.continuum.builddefinition.DefaultBuildDefinitionServiceTest
17:17:56,319 WARN  [PlexusLifecycleBeanPostProcessor.getLoggerManager](104) No loggerManager set in context. Falling back to ConsoleLoggerManager
[WARNING] Could not find the executable 'mvn' in the path '[]'.
[WARNING] Could not find the executable 'maven' in the path '[]'.
[WARNING] Could not find the executable 'ant' in the path '[]'.
17:17:56,650 WARN  [MetaData.warn](98) No manager for annotations was found in the CLASSPATH so all annotations are ignored.
17:17:57,061 WARN  [MetaData.warn](98) No manager for annotations was found in the CLASSPATH so all annotations are ignored.
[INFO] create default AntBuildDefinitionTemplate
[INFO] create Default Schedule
[INFO] create default MavenOneBuildDefinitionTemplate
[INFO] create default MavenTwoBuildDefinitionTemplate
[INFO] create default ShellBuildDefinitionTemplate
17:17:58,189 WARN  [PlexusLifecycleBeanPostProcessor.getLoggerManager](104) No loggerManager set in context. Falling back to ConsoleLoggerManager
[WARNING] Could not find the executable 'mvn' in the path '[]'.
[WARNING] Could not find the executable 'maven' in the path '[]'.
[WARNING] Could not find the executable 'ant' in the path '[]'.
17:17:58,439 WARN  [MetaData.warn](98) No manager for annotations was found in the CLASSPATH so all annotations are ignored.
17:17:58,852 WARN  [MetaData.warn](98) No manager for annotations was found in the CLASSPATH so all annotations are ignored.
[INFO] create default AntBuildDefinitionTemplate
[INFO] create Default Schedule
[INFO] create default MavenOneBuildDefinitionTemplate
[INFO] create default MavenTwoBuildDefinitionTemplate
[INFO] create default ShellBuildDefinitionTemplate
17:18:00,246 WARN  [PlexusLifecycleBeanPostProcessor.getLoggerManager](104) No loggerManager set in context. Falling back to ConsoleLoggerManager
[WARNING] Could not find the executable 'mvn' in the path '[]'.
[WARNING] Could not find the executable 'maven' in the path '[]'.
[WARNING] Could not find the executable 'ant' in the path '[]'.
17:18:00,564 WARN  [MetaData.warn](98) No manager for annotations was found in the CLASSPATH so all annotations are ignored.
17:18:00,981 WARN  [MetaData.warn](98) No manager for annotations was found in the CLASSPATH so all annotations are ignored.
[INFO] create default AntBuildDefinitionTemplate
[INFO] create Default Schedule
[INFO] create default MavenOneBuildDefinitionTemplate
[INFO] create default MavenTwoBuildDefinitionTemplate
[INFO] create default ShellBuildDefinitionTemplate
Tests run: 3, Failures: 0, Errors: 0, Skipped: 0, Time elapsed: 5.692 sec
Running org.apache.maven.continuum.execution.shell.ShellBuildExecutorTest
[INFO] Exit code: 0
Tests run: 1, Failures: 0, Errors: 0, Skipped: 0, Time elapsed: 0.017 sec
Running org.apache.maven.continuum.scm.ContinuumScmTest
17:18:02,011 WARN  [PlexusLifecycleBeanPostProcessor.getLoggerManager](104) No loggerManager set in context. Falling back to ConsoleLoggerManager
[WARNING] Could not find the executable 'mvn' in the path '[]'.
[WARNING] Could not find the executable 'maven' in the path '[]'.
[WARNING] Could not find the executable 'ant' in the path '[]'.
17:18:02,321 WARN  [MetaData.warn](98) No manager for annotations was found in the CLASSPATH so all annotations are ignored.
17:18:02,731 WARN  [MetaData.warn](98) No manager for annotations was found in the CLASSPATH so all annotations are ignored.
Tests run: 1, Failures: 0, Errors: 0, Skipped: 0, Time elapsed: 1.643 sec
Running org.apache.maven.continuum.DefaultContinuumTest
17:18:03,664 WARN  [PlexusLifecycleBeanPostProcessor.getLoggerManager](104) No loggerManager set in context. Falling back to ConsoleLoggerManager
[WARNING] Could not find the executable 'mvn' in the path '[]'.
[WARNING] Could not find the executable 'maven' in the path '[]'.
[WARNING] Could not find the executable 'ant' in the path '[]'.
17:18:04,010 WARN  [MetaData.warn](98) No manager for annotations was found in the CLASSPATH so all annotations are ignored.
17:18:04,403 WARN  [MetaData.warn](98) No manager for annotations was found in the CLASSPATH so all annotations are ignored.
[INFO] create default AntBuildDefinitionTemplate
[INFO] create Default Schedule
[INFO] create default MavenOneBuildDefinitionTemplate
[INFO] create default MavenTwoBuildDefinitionTemplate
[INFO] create default ShellBuildDefinitionTemplate
[INFO] Build executors:
[INFO]   shell
[INFO]   maven-1
[INFO]   ant
[INFO]   maven2
[INFO] Initializing Continuum.
[INFO] Showing all projects: 
[INFO] Starting Continuum.
[INFO] 
[INFO] 
[INFO] < Continuum unknown started! >
[INFO] ------------------------------
[INFO]        \   ^__^
[INFO]         \  (oo)\_______
[INFO]            (__)\       )\/\
[INFO]                ||----w |
[INFO]                ||     ||
[INFO] 
[INFO] 
[INFO] Continuum initializer running ...
[INFO] Default Project Group exists
[INFO] Continuum initializer end running ...
[INFO] Activating schedules ...
[WARNING] Will not schedule this job as a job {DEFAULT_SCHEDULE:DEFAULT} already exists.
[INFO] DEFAULT_SCHEDULE: next fire time ->null
17:18:05,593 WARN  [PlexusLifecycleBeanPostProcessor.getLoggerManager](104) No loggerManager set in context. Falling back to ConsoleLoggerManager
[WARNING] Could not find the executable 'mvn' in the path '[]'.
[WARNING] Could not find the executable 'maven' in the path '[]'.
[WARNING] Could not find the executable 'ant' in the path '[]'.
17:18:05,949 WARN  [MetaData.warn](98) No manager for annotations was found in the CLASSPATH so all annotations are ignored.
17:18:06,357 WARN  [MetaData.warn](98) No manager for annotations was found in the CLASSPATH so all annotations are ignored.
[WARNING] Using 'nobody@localhost' as the to address for all emails.
[INFO] Starting task executor, thread name 'build-project'.
[INFO] Starting task executor, thread name 'check-out-project'.
17:18:07,332 WARN  [PlexusLifecycleBeanPostProcessor.getLoggerManager](104) No loggerManager set in context. Falling back to ConsoleLoggerManager
[WARNING] Could not find the executable 'mvn' in the path '[]'.
[WARNING] Could not find the executable 'maven' in the path '[]'.
[WARNING] Could not find the executable 'ant' in the path '[]'.
17:18:07,690 WARN  [MetaData.warn](98) No manager for annotations was found in the CLASSPATH so all annotations are ignored.
17:18:08,096 WARN  [MetaData.warn](98) No manager for annotations was found in the CLASSPATH so all annotations are ignored.
[INFO] create default AntBuildDefinitionTemplate
[INFO] create Default Schedule
[INFO] create default MavenOneBuildDefinitionTemplate
[INFO] create default MavenTwoBuildDefinitionTemplate
[INFO] create default ShellBuildDefinitionTemplate
[INFO] Build executors:
[INFO]   shell
[INFO]   maven-1
[INFO]   ant
[INFO]   maven2
[INFO] Initializing Continuum.
[INFO] Showing all projects: 
[INFO] Starting Continuum.
[INFO] 
[INFO] 
[INFO] < Continuum unknown started! >
[INFO] ------------------------------
[INFO]        \   ^__^
[INFO]         \  (oo)\_______
[INFO]            (__)\       )\/\
[INFO]                ||----w |
[INFO]                ||     ||
[INFO] 
[INFO] 
[INFO] Continuum initializer running ...
[INFO] Default Project Group exists
[INFO] Continuum initializer end running ...
[INFO] Activating schedules ...
[WARNING] Will not schedule this job as a job {DEFAULT_SCHEDULE:DEFAULT} already exists.
[INFO] DEFAULT_SCHEDULE: next fire time ->null
[INFO] Downloading file:/home/continuum/data/working-directory/463/src/test/resources/projects/continuum/continuum-notifiers/pom.xml
[INFO] Downloading file:/home/continuum/data/working-directory/463/src/test/resources/projects/continuum/continuum-notifiers/continuum-notifier-irc/pom.xml
[INFO] Downloading file:/home/continuum/data/working-directory/463/src/test/resources/projects/continuum/continuum-notifiers/continuum-notifier-jabber/pom.xml
[INFO] Created 3 projects.
[INFO] Created 1 project groups.
[INFO] 0 errors.
[INFO] Creating project group with the group id: 'org.apache.maven.continuum'.
[INFO] loading redback-xwork-integration-core
[INFO] loading Continuum
number of projects: 3
number of project groups: 2
17:18:11,316 WARN  [PlexusLifecycleBeanPostProcessor.getLoggerManager](104) No loggerManager set in context. Falling back to ConsoleLoggerManager
[WARNING] Could not find the executable 'mvn' in the path '[]'.
[WARNING] Could not find the executable 'maven' in the path '[]'.
[WARNING] Could not find the executable 'ant' in the path '[]'.
17:18:11,624 WARN  [MetaData.warn](98) No manager for annotations was found in the CLASSPATH so all annotations are ignored.
17:18:12,044 WARN  [MetaData.warn](98) No manager for annotations was found in the CLASSPATH so all annotations are ignored.
[INFO] create default AntBuildDefinitionTemplate
[INFO] create Default Schedule
[INFO] create default MavenOneBuildDefinitionTemplate
[INFO] create default MavenTwoBuildDefinitionTemplate
[INFO] create default ShellBuildDefinitionTemplate
[INFO] Build executors:
[INFO]   shell
[INFO]   maven-1
[INFO]   ant
[INFO]   maven2
[INFO] Initializing Continuum.
[INFO] Showing all projects: 
[INFO] Starting Continuum.
[INFO] 
[INFO] 
[INFO] < Continuum unknown started! >
[INFO] ------------------------------
[INFO]        \   ^__^
[INFO]         \  (oo)\_______
[INFO]            (__)\       )\/\
[INFO]                ||----w |
[INFO]                ||     ||
[INFO] 
[INFO] 
[INFO] Continuum initializer running ...
[INFO] Default Project Group exists
[INFO] Continuum initializer end running ...
[INFO] Activating schedules ...
[WARNING] Will not schedule this job as a job {DEFAULT_SCHEDULE:DEFAULT} already exists.
[INFO] DEFAULT_SCHEDULE: next fire time ->null
[INFO] Downloading file:/home/continuum/data/working-directory/463/src/test-projects/project1/pom.xml
[INFO] Created 1 projects.
[INFO] Created 1 project groups.
[INFO] 0 errors.
[INFO] Creating project group with the group id: 'plexus'.
[INFO] loading redback-xwork-integration-core
[INFO] loading Continuum
17:18:13,963 WARN  [PlexusLifecycleBeanPostProcessor.getLoggerManager](104) No loggerManager set in context. Falling back to ConsoleLoggerManager
[WARNING] Could not find the executable 'mvn' in the path '[]'.
[WARNING] Could not find the executable 'maven' in the path '[]'.
[WARNING] Could not find the executable 'ant' in the path '[]'.
17:18:14,255 WARN  [MetaData.warn](98) No manager for annotations was found in the CLASSPATH so all annotations are ignored.
17:18:14,664 WARN  [MetaData.warn](98) No manager for annotations was found in the CLASSPATH so all annotations are ignored.
[INFO] create default AntBuildDefinitionTemplate
[INFO] create Default Schedule
[INFO] create default MavenOneBuildDefinitionTemplate
[INFO] create default MavenTwoBuildDefinitionTemplate
[INFO] create default ShellBuildDefinitionTemplate
[INFO] Build executors:
[INFO]   shell
[INFO]   maven-1
[INFO]   ant
[INFO]   maven2
[INFO] Initializing Continuum.
[INFO] Showing all projects: 
[INFO] Starting Continuum.
[INFO] 
[INFO] 
[INFO] < Continuum unknown started! >
[INFO] ------------------------------
[INFO]        \   ^__^
[INFO]         \  (oo)\_______
[INFO]            (__)\       )\/\
[INFO]                ||----w |
[INFO]                ||     ||
[INFO] 
[INFO] 
[INFO] Continuum initializer running ...
[INFO] Default Project Group exists
[INFO] Continuum initializer end running ...
[INFO] Activating schedules ...
[WARNING] Will not schedule this job as a job {DEFAULT_SCHEDULE:DEFAULT} already exists.
[INFO] DEFAULT_SCHEDULE: next fire time ->null
[INFO] Downloading file:/home/continuum/data/working-directory/463/src/test-projects/project1/pom.xml
[INFO] Created 1 projects.
[INFO] Created 1 project groups.
[INFO] 0 errors.
[INFO] Creating project group with the group id: 'plexus'.
[INFO] loading redback-xwork-integration-core
[INFO] loading Continuum
17:18:17,311 WARN  [PlexusLifecycleBeanPostProcessor.getLoggerManager](104) No loggerManager set in context. Falling back to ConsoleLoggerManager
[WARNING] Could not find the executable 'mvn' in the path '[]'.
[WARNING] Could not find the executable 'maven' in the path '[]'.
[WARNING] Could not find the executable 'ant' in the path '[]'.
17:18:17,700 WARN  [MetaData.warn](98) No manager for annotations was found in the CLASSPATH so all annotations are ignored.
17:18:18,086 WARN  [MetaData.warn](98) No manager for annotations was found in the CLASSPATH so all annotations are ignored.
[INFO] create default AntBuildDefinitionTemplate
[INFO] create Default Schedule
[INFO] create default MavenOneBuildDefinitionTemplate
[INFO] create default MavenTwoBuildDefinitionTemplate
[INFO] create default ShellBuildDefinitionTemplate
[INFO] Build executors:
[INFO]   shell
[INFO]   maven-1
[INFO]   ant
[INFO]   maven2
[INFO] Initializing Continuum.
[INFO] Showing all projects: 
[INFO] Starting Continuum.
[INFO] 
[INFO] 
[INFO] < Continuum unknown started! >
[INFO] ------------------------------
[INFO]        \   ^__^
[INFO]         \  (oo)\_______
[INFO]            (__)\       )\/\
[INFO]                ||----w |
[INFO]                ||     ||
[INFO] 
[INFO] 
[INFO] Continuum initializer running ...
[INFO] Default Project Group exists
[INFO] Continuum initializer end running ...
[INFO] Activating schedules ...
[WARNING] Will not schedule this job as a job {DEFAULT_SCHEDULE:DEFAULT} already exists.
[INFO] DEFAULT_SCHEDULE: next fire time ->null
[INFO] Downloading file:/home/continuum/data/working-directory/463/src/test-projects/project1/pom.xml
[INFO] Created 1 projects.
[INFO] Created 1 project groups.
[INFO] 0 errors.
[INFO] Creating project group with the group id: 'plexus'.
[INFO] loading redback-xwork-integration-core
[INFO] loading Continuum
[INFO] Remove project Continuum Test Project 1(1)
[WARNING] Using 'nobody@localhost' as the to address for all emails.
[INFO] Starting task executor, thread name 'build-project'.
[INFO] Remove project group Continuum Test Project 1(2)
17:18:19,554 WARN  [PlexusLifecycleBeanPostProcessor.getLoggerManager](104) No loggerManager set in context. Falling back to ConsoleLoggerManager
[WARNING] Could not find the executable 'mvn' in the path '[]'.
[WARNING] Could not find the executable 'maven' in the path '[]'.
[WARNING] Could not find the executable 'ant' in the path '[]'.
17:18:19,956 WARN  [MetaData.warn](98) No manager for annotations was found in the CLASSPATH so all annotations are ignored.
17:18:20,368 WARN  [MetaData.warn](98) No manager for annotations was found in the CLASSPATH so all annotations are ignored.
[INFO] create default AntBuildDefinitionTemplate
[INFO] create Default Schedule
[INFO] create default MavenOneBuildDefinitionTemplate
[INFO] create default MavenTwoBuildDefinitionTemplate
[INFO] create default ShellBuildDefinitionTemplate
[INFO] Build executors:
[INFO]   shell
[INFO]   maven-1
[INFO]   ant
[INFO]   maven2
[INFO] Initializing Continuum.
[INFO] Showing all projects: 
[INFO] Starting Continuum.
[INFO] 
[INFO] 
[INFO] < Continuum unknown started! >
[INFO] ------------------------------
[INFO]        \   ^__^
[INFO]         \  (oo)\_______
[INFO]            (__)\       )\/\
[INFO]                ||----w |
[INFO]                ||     ||
[INFO] 
[INFO] 
[INFO] Continuum initializer running ...
[INFO] Default Project Group exists
[INFO] Continuum initializer end running ...
[INFO] Activating schedules ...
[WARNING] Will not schedule this job as a job {DEFAULT_SCHEDULE:DEFAULT} already exists.
[INFO] DEFAULT_SCHEDULE: next fire time ->null
[INFO] Downloading file:/home/continuum/data/working-directory/463/src/test-projects/project1/pom.xml
[INFO] Created 1 projects.
[INFO] Created 1 project groups.
[INFO] 0 errors.
[INFO] Creating project group with the group id: 'plexus'.
[INFO] loading redback-xwork-integration-core
[INFO] loading Continuum
17:18:22,332 WARN  [PlexusLifecycleBeanPostProcessor.getLoggerManager](104) No loggerManager set in context. Falling back to ConsoleLoggerManager
[WARNING] Could not find the executable 'mvn' in the path '[]'.
[WARNING] Could not find the executable 'maven' in the path '[]'.
[WARNING] Could not find the executable 'ant' in the path '[]'.
17:18:22,683 WARN  [MetaData.warn](98) No manager for annotations was found in the CLASSPATH so all annotations are ignored.
17:18:23,084 WARN  [MetaData.warn](98) No manager for annotations was found in the CLASSPATH so all annotations are ignored.
[INFO] create default AntBuildDefinitionTemplate
[INFO] create Default Schedule
[INFO] create default MavenOneBuildDefinitionTemplate
[INFO] create default MavenTwoBuildDefinitionTemplate
[INFO] create default ShellBuildDefinitionTemplate
[INFO] Build executors:
[INFO]   shell
[INFO]   maven-1
[INFO]   ant
[INFO]   maven2
[INFO] Initializing Continuum.
[INFO] Showing all projects: 
[INFO] Starting Continuum.
[INFO] 
[INFO] 
[INFO] < Continuum unknown started! >
[INFO] ------------------------------
[INFO]        \   ^__^
[INFO]         \  (oo)\_______
[INFO]            (__)\       )\/\
[INFO]                ||----w |
[INFO]                ||     ||
[INFO] 
[INFO] 
[INFO] Continuum initializer running ...
[INFO] Default Project Group exists
[INFO] Continuum initializer end running ...
[INFO] Activating schedules ...
[WARNING] Will not schedule this job as a job {DEFAULT_SCHEDULE:DEFAULT} already exists.
[INFO] DEFAULT_SCHEDULE: next fire time ->null
17:18:24,488 WARN  [PlexusLifecycleBeanPostProcessor.getLoggerManager](104) No loggerManager set in context. Falling back to ConsoleLoggerManager
[WARNING] Could not find the executable 'mvn' in the path '[]'.
[WARNING] Could not find the executable 'maven' in the path '[]'.
[WARNING] Could not find the executable 'ant' in the path '[]'.
17:18:24,895 WARN  [MetaData.warn](98) No manager for annotations was found in the CLASSPATH so all annotations are ignored.
17:18:25,283 WARN  [MetaData.warn](98) No manager for annotations was found in the CLASSPATH so all annotations are ignored.
[INFO] create default AntBuildDefinitionTemplate
[INFO] create Default Schedule
[INFO] create default MavenOneBuildDefinitionTemplate
[INFO] create default MavenTwoBuildDefinitionTemplate
[INFO] create default ShellBuildDefinitionTemplate
[INFO] Build executors:
[INFO]   shell
[INFO]   maven-1
[INFO]   ant
[INFO]   maven2
[INFO] Initializing Continuum.
[INFO] Showing all projects: 
[INFO] Starting Continuum.
[INFO] 
[INFO] 
[INFO] < Continuum unknown started! >
[INFO] ------------------------------
[INFO]        \   ^__^
[INFO]         \  (oo)\_______
[INFO]            (__)\       )\/\
[INFO]                ||----w |
[INFO]                ||     ||
[INFO] 
[INFO] 
[INFO] Continuum initializer running ...
[INFO] Default Project Group exists
[INFO] Continuum initializer end running ...
[INFO] Activating schedules ...
[WARNING] Will not schedule this job as a job {DEFAULT_SCHEDULE:DEFAULT} already exists.
[INFO] DEFAULT_SCHEDULE: next fire time ->null
[INFO] Downloading file:/home/continuum/data/working-directory/463/src/test-projects/project1/pom.xml
[INFO] Created 1 projects.
[INFO] Created 1 project groups.
[INFO] 0 errors.
[INFO] Creating project group with the group id: 'plexus'.
[INFO] loading redback-xwork-integration-core
[INFO] loading Continuum
17:18:26,829 WARN  [PlexusLifecycleBeanPostProcessor.getLoggerManager](104) No loggerManager set in context. Falling back to ConsoleLoggerManager
[WARNING] Could not find the executable 'mvn' in the path '[]'.
[WARNING] Could not find the executable 'maven' in the path '[]'.
[WARNING] Could not find the executable 'ant' in the path '[]'.
17:18:27,224 WARN  [MetaData.warn](98) No manager for annotations was found in the CLASSPATH so all annotations are ignored.
17:18:27,625 WARN  [MetaData.warn](98) No manager for annotations was found in the CLASSPATH so all annotations are ignored.
[INFO] create default AntBuildDefinitionTemplate
[INFO] create Default Schedule
[INFO] create default MavenOneBuildDefinitionTemplate
[INFO] create default MavenTwoBuildDefinitionTemplate
[INFO] create default ShellBuildDefinitionTemplate
[INFO] Build executors:
[INFO]   shell
[INFO]   maven-1
[INFO]   ant
[INFO]   maven2
[INFO] Initializing Continuum.
[INFO] Showing all projects: 
[INFO] Starting Continuum.
[INFO] 
[INFO] 
[INFO] < Continuum unknown started! >
[INFO] ------------------------------
[INFO]        \   ^__^
[INFO]         \  (oo)\_______
[INFO]            (__)\       )\/\
[INFO]                ||----w |
[INFO]                ||     ||
[INFO] 
[INFO] 
[INFO] Continuum initializer running ...
[INFO] Default Project Group exists
[INFO] Continuum initializer end running ...
[INFO] Activating schedules ...
[WARNING] Will not schedule this job as a job {DEFAULT_SCHEDULE:DEFAULT} already exists.
[INFO] DEFAULT_SCHEDULE: next fire time ->null
[INFO] loading redback-xwork-integration-core
[INFO] loading Continuum
Tests run: 10, Failures: 0, Errors: 0, Skipped: 0, Time elapsed: 25.035 sec
Running org.apache.maven.continuum.buildcontroller.DefaultBuildControllerTest
17:18:28,748 WARN  [PlexusLifecycleBeanPostProcessor.getLoggerManager](104) No loggerManager set in context. Falling back to ConsoleLoggerManager
[WARNING] Could not find the executable 'mvn' in the path '[]'.
[WARNING] Could not find the executable 'maven' in the path '[]'.
[WARNING] Could not find the executable 'ant' in the path '[]'.
17:18:29,114 WARN  [MetaData.warn](98) No manager for annotations was found in the CLASSPATH so all annotations are ignored.
17:18:29,499 WARN  [MetaData.warn](98) No manager for annotations was found in the CLASSPATH so all annotations are ignored.
[WARNING] Using 'nobody@localhost' as the to address for all emails.
[INFO] The project was not built because no changes were detected in sources since the last build.
[INFO] No changes, not building
17:18:30,885 WARN  [PlexusLifecycleBeanPostProcessor.getLoggerManager](104) No loggerManager set in context. Falling back to ConsoleLoggerManager
[WARNING] Could not find the executable 'mvn' in the path '[]'.
[WARNING] Could not find the executable 'maven' in the path '[]'.
[WARNING] Could not find the executable 'ant' in the path '[]'.
17:18:31,284 WARN  [MetaData.warn](98) No manager for annotations was found in the CLASSPATH so all annotations are ignored.
17:18:31,629 WARN  [MetaData.warn](98) No manager for annotations was found in the CLASSPATH so all annotations are ignored.
[WARNING] Using 'nobody@localhost' as the to address for all emails.
[INFO] The project was never be built with the current build definition, building
17:18:32,598 WARN  [PlexusLifecycleBeanPostProcessor.getLoggerManager](104) No loggerManager set in context. Falling back to ConsoleLoggerManager
[WARNING] Could not find the executable 'mvn' in the path '[]'.
[WARNING] Could not find the executable 'maven' in the path '[]'.
[WARNING] Could not find the executable 'ant' in the path '[]'.
17:18:32,947 WARN  [MetaData.warn](98) No manager for annotations was found in the CLASSPATH so all annotations are ignored.
17:18:33,346 WARN  [MetaData.warn](98) No manager for annotations was found in the CLASSPATH so all annotations are ignored.
[WARNING] Using 'nobody@localhost' as the to address for all emails.
[INFO] The project was never be built with the current build definition, building
17:18:34,308 WARN  [PlexusLifecycleBeanPostProcessor.getLoggerManager](104) No loggerManager set in context. Falling back to ConsoleLoggerManager
[WARNING] Could not find the executable 'mvn' in the path '[]'.
[WARNING] Could not find the executable 'maven' in the path '[]'.
[WARNING] Could not find the executable 'ant' in the path '[]'.
17:18:34,762 WARN  [MetaData.warn](98) No manager for annotations was found in the CLASSPATH so all annotations are ignored.
17:18:35,177 WARN  [MetaData.warn](98) No manager for annotations was found in the CLASSPATH so all annotations are ignored.
[WARNING] Using 'nobody@localhost' as the to address for all emails.
[INFO] The project was not built because no changes were detected in sources since the last build.
[INFO] Found dependencies changes, building
[INFO] Changes found, building
Tests run: 4, Failures: 0, Errors: 0, Skipped: 0, Time elapsed: 7.457 sec
Running org.apache.maven.continuum.profile.DefaultProfileServiceTest
17:18:36,111 WARN  [PlexusLifecycleBeanPostProcessor.getLoggerManager](104) No loggerManager set in context. Falling back to ConsoleLoggerManager
[WARNING] Could not find the executable 'mvn' in the path '[]'.
[WARNING] Could not find the executable 'maven' in the path '[]'.
[WARNING] Could not find the executable 'ant' in the path '[]'.
17:18:36,916 WARN  [MetaData.warn](98) No manager for annotations was found in the CLASSPATH so all annotations are ignored.
17:18:37,268 WARN  [MetaData.warn](98) No manager for annotations was found in the CLASSPATH so all annotations are ignored.
17:18:38,172 WARN  [PlexusLifecycleBeanPostProcessor.getLoggerManager](104) No loggerManager set in context. Falling back to ConsoleLoggerManager
[WARNING] Could not find the executable 'mvn' in the path '[]'.
[WARNING] Could not find the executable 'maven' in the path '[]'.
[WARNING] Could not find the executable 'ant' in the path '[]'.
17:18:38,580 WARN  [MetaData.warn](98) No manager for annotations was found in the CLASSPATH so all annotations are ignored.
17:18:38,970 WARN  [MetaData.warn](98) No manager for annotations was found in the CLASSPATH so all annotations are ignored.
17:18:39,840 WARN  [PlexusLifecycleBeanPostProcessor.getLoggerManager](104) No loggerManager set in context. Falling back to ConsoleLoggerManager
[WARNING] Could not find the executable 'mvn' in the path '[]'.
[WARNING] Could not find the executable 'maven' in the path '[]'.
[WARNING] Could not find the executable 'ant' in the path '[]'.
17:18:40,251 WARN  [MetaData.warn](98) No manager for annotations was found in the CLASSPATH so all annotations are ignored.
17:18:40,603 WARN  [MetaData.warn](98) No manager for annotations was found in the CLASSPATH so all annotations are ignored.
17:18:41,443 WARN  [PlexusLifecycleBeanPostProcessor.getLoggerManager](104) No loggerManager set in context. Falling back to ConsoleLoggerManager
[WARNING] Could not find the executable 'mvn' in the path '[]'.
[WARNING] Could not find the executable 'maven' in the path '[]'.
[WARNING] Could not find the executable 'ant' in the path '[]'.
17:18:41,873 WARN  [MetaData.warn](98) No manager for annotations was found in the CLASSPATH so all annotations are ignored.
17:18:42,253 WARN  [MetaData.warn](98) No manager for annotations was found in the CLASSPATH so all annotations are ignored.
17:18:43,127 WARN  [PlexusLifecycleBeanPostProcessor.getLoggerManager](104) No loggerManager set in context. Falling back to ConsoleLoggerManager
[WARNING] Could not find the executable 'mvn' in the path '[]'.
[WARNING] Could not find the executable 'maven' in the path '[]'.
[WARNING] Could not find the executable 'ant' in the path '[]'.
17:18:43,930 WARN  [MetaData.warn](98) No manager for annotations was found in the CLASSPATH so all annotations are ignored.
17:18:44,331 WARN  [MetaData.warn](98) No manager for annotations was found in the CLASSPATH so all annotations are ignored.
17:18:45,156 WARN  [PlexusLifecycleBeanPostProcessor.getLoggerManager](104) No loggerManager set in context. Falling back to ConsoleLoggerManager
[WARNING] Could not find the executable 'mvn' in the path '[]'.
[WARNING] Could not find the executable 'maven' in the path '[]'.
[WARNING] Could not find the executable 'ant' in the path '[]'.
17:18:45,609 WARN  [MetaData.warn](98) No manager for annotations was found in the CLASSPATH so all annotations are ignored.
17:18:46,021 WARN  [MetaData.warn](98) No manager for annotations was found in the CLASSPATH so all annotations are ignored.
17:18:46,874 WARN  [PlexusLifecycleBeanPostProcessor.getLoggerManager](104) No loggerManager set in context. Falling back to ConsoleLoggerManager
[WARNING] Could not find the executable 'mvn' in the path '[]'.
[WARNING] Could not find the executable 'maven' in the path '[]'.
[WARNING] Could not find the executable 'ant' in the path '[]'.
17:18:47,331 WARN  [MetaData.warn](98) No manager for annotations was found in the CLASSPATH so all annotations are ignored.
17:18:47,722 WARN  [MetaData.warn](98) No manager for annotations was found in the CLASSPATH so all annotations are ignored.
17:18:48,572 WARN  [PlexusLifecycleBeanPostProcessor.getLoggerManager](104) No loggerManager set in context. Falling back to ConsoleLoggerManager
[WARNING] Could not find the executable 'mvn' in the path '[]'.
[WARNING] Could not find the executable 'maven' in the path '[]'.
[WARNING] Could not find the executable 'ant' in the path '[]'.
17:18:49,033 WARN  [MetaData.warn](98) No manager for annotations was found in the CLASSPATH so all annotations are ignored.
17:18:49,372 WARN  [MetaData.warn](98) No manager for annotations was found in the CLASSPATH so all annotations are ignored.
Tests run: 8, Failures: 0, Errors: 0, Skipped: 0, Time elapsed: 14.151 sec
Running org.apache.maven.continuum.notification.ContinuumNotificationDispatcherTest
17:18:50,291 WARN  [PlexusLifecycleBeanPostProcessor.getLoggerManager](104) No loggerManager set in context. Falling back to ConsoleLoggerManager
[WARNING] Could not find the executable 'mvn' in the path '[]'.
[WARNING] Could not find the executable 'maven' in the path '[]'.
[WARNING] Could not find the executable 'ant' in the path '[]'.
17:18:50,764 WARN  [MetaData.warn](98) No manager for annotations was found in the CLASSPATH so all annotations are ignored.
17:18:51,132 WARN  [MetaData.warn](98) No manager for annotations was found in the CLASSPATH so all annotations are ignored.
[INFO] create default AntBuildDefinitionTemplate
[INFO] create Default Schedule
[INFO] create default MavenOneBuildDefinitionTemplate
[INFO] create default MavenTwoBuildDefinitionTemplate
[INFO] create default ShellBuildDefinitionTemplate
[INFO] Build executors:
[INFO]   shell
[INFO]   maven-1
[INFO]   ant
[INFO]   maven2
[INFO] Initializing Continuum.
[INFO] Showing all projects: 
[INFO] Starting Continuum.
[INFO] 
[INFO] 
[INFO] < Continuum unknown started! >
[INFO] ------------------------------
[INFO]        \   ^__^
[INFO]         \  (oo)\_______
[INFO]            (__)\       )\/\
[INFO]                ||----w |
[INFO]                ||     ||
[INFO] 
[INFO] 
[INFO] Continuum initializer running ...
[INFO] Default Project Group exists
[INFO] Continuum initializer end running ...
[INFO] Activating schedules ...
[WARNING] Will not schedule this job as a job {DEFAULT_SCHEDULE:DEFAULT} already exists.
[INFO] DEFAULT_SCHEDULE: next fire time ->null
[INFO] Using 'continuum@localhost' as the from mailbox for all emails.
[INFO] From name: Continuum
[INFO] Build host name: vmbuild.apache.org
[WARNING] Using 'nobody@localhost' as the to address for all emails.
[ERROR] Error while trying to use the mail notifier.
org.codehaus.plexus.notification.NotificationException: Error while generating mail contents.
	at org.apache.maven.continuum.notification.mail.MailContinuumNotifier.buildComplete(MailContinuumNotifier.java:370)
	at org.apache.maven.continuum.notification.mail.MailContinuumNotifier.sendNotification(MailContinuumNotifier.java:254)
	at org.apache.maven.continuum.notification.DefaultContinuumNotificationDispatcher.sendNotification(DefaultContinuumNotificationDispatcher.java:199)
	at org.apache.maven.continuum.notification.DefaultContinuumNotificationDispatcher.sendNotification(DefaultContinuumNotificationDispatcher.java:151)
	at org.apache.maven.continuum.notification.DefaultContinuumNotificationDispatcher.buildComplete(DefaultContinuumNotificationDispatcher.java:103)
	at org.apache.maven.continuum.notification.ContinuumNotificationDispatcherTest.testNotificationDispatcher(ContinuumNotificationDispatcherTest.java:59)
	at sun.reflect.NativeMethodAccessorImpl.invoke0(Native Method)
	at sun.reflect.NativeMethodAccessorImpl.invoke(NativeMethodAccessorImpl.java:39)
	at sun.reflect.DelegatingMethodAccessorImpl.invoke(DelegatingMethodAccessorImpl.java:25)
	at java.lang.reflect.Method.invoke(Method.java:597)
	at junit.framework.TestCase.runTest(TestCase.java:154)
	at junit.framework.TestCase.runBare(TestCase.java:127)
	at junit.framework.TestResult$1.protect(TestResult.java:106)
	at junit.framework.TestResult.runProtected(TestResult.java:124)
	at junit.framework.TestResult.run(TestResult.java:109)
	at junit.framework.TestCase.run(TestCase.java:118)
	at junit.framework.TestSuite.runTest(TestSuite.java:208)
	at junit.framework.TestSuite.run(TestSuite.java:203)
	at sun.reflect.NativeMethodAccessorImpl.invoke0(Native Method)
	at sun.reflect.NativeMethodAccessorImpl.invoke(NativeMethodAccessorImpl.java:39)
	at sun.reflect.DelegatingMethodAccessorImpl.invoke(DelegatingMethodAccessorImpl.java:25)
	at java.lang.reflect.Method.invoke(Method.java:597)
	at org.apache.maven.surefire.junit.JUnitTestSet.execute(JUnitTestSet.java:213)
	at org.apache.maven.surefire.suite.AbstractDirectoryTestSuite.executeTestSet(AbstractDirectoryTestSuite.java:140)
	at org.apache.maven.surefire.suite.AbstractDirectoryTestSuite.execute(AbstractDirectoryTestSuite.java:127)
	at org.apache.maven.surefire.Surefire.run(Surefire.java:177)
	at sun.reflect.NativeMethodAccessorImpl.invoke0(Native Method)
	at sun.reflect.NativeMethodAccessorImpl.invoke(NativeMethodAccessorImpl.java:39)
	at sun.reflect.DelegatingMethodAccessorImpl.invoke(DelegatingMethodAccessorImpl.java:25)
	at java.lang.reflect.Method.invoke(Method.java:597)
	at org.apache.maven.surefire.booter.SurefireBooter.runSuitesInProcess(SurefireBooter.java:338)
	at org.apache.maven.surefire.booter.SurefireBooter.main(SurefireBooter.java:997)
Caused by: java.lang.NullPointerException
	at org.apache.maven.continuum.notification.mail.MailContinuumNotifier.buildComplete(MailContinuumNotifier.java:304)
	... 31 more
Tests run: 1, Failures: 0, Errors: 0, Skipped: 0, Time elapsed: 1.909 sec
Running org.apache.maven.continuum.execution.maven.m1.MavenOneBuildExecutorTest
17:18:52,578 WARN  [PlexusLifecycleBeanPostProcessor.getLoggerManager](104) No loggerManager set in context. Falling back to ConsoleLoggerManager
[WARNING] Could not find the executable 'mvn' in the path '[]'.
[WARNING] Could not find the executable 'maven' in the path '[]'.
[WARNING] Could not find the executable 'ant' in the path '[]'.
17:18:53,052 WARN  [MetaData.warn](98) No manager for annotations was found in the CLASSPATH so all annotations are ignored.
17:18:53,443 WARN  [MetaData.warn](98) No manager for annotations was found in the CLASSPATH so all annotations are ignored.
[INFO] Build executors:
[INFO]   shell
[INFO]   maven-1
[INFO]   ant
[INFO]   maven2
17:18:54,251 WARN  [PlexusLifecycleBeanPostProcessor.getLoggerManager](104) No loggerManager set in context. Falling back to ConsoleLoggerManager
[WARNING] Could not find the executable 'mvn' in the path '[]'.
[WARNING] Could not find the executable 'maven' in the path '[]'.
[WARNING] Could not find the executable 'ant' in the path '[]'.
17:18:54,739 WARN  [MetaData.warn](98) No manager for annotations was found in the CLASSPATH so all annotations are ignored.
17:18:55,130 WARN  [MetaData.warn](98) No manager for annotations was found in the CLASSPATH so all annotations are ignored.
[INFO] Build executors:
[INFO]   shell
[INFO]   maven-1
[INFO]   ant
[INFO]   maven2
17:18:55,977 WARN  [PlexusLifecycleBeanPostProcessor.getLoggerManager](104) No loggerManager set in context. Falling back to ConsoleLoggerManager
[WARNING] Could not find the executable 'mvn' in the path '[]'.
[WARNING] Could not find the executable 'maven' in the path '[]'.
[WARNING] Could not find the executable 'ant' in the path '[]'.
17:18:56,447 WARN  [MetaData.warn](98) No manager for annotations was found in the CLASSPATH so all annotations are ignored.
17:18:56,835 WARN  [MetaData.warn](98) No manager for annotations was found in the CLASSPATH so all annotations are ignored.
[INFO] Build executors:
[INFO]   shell
[INFO]   maven-1
[INFO]   ant
[INFO]   maven2
17:18:57,583 WARN  [PlexusLifecycleBeanPostProcessor.getLoggerManager](104) No loggerManager set in context. Falling back to ConsoleLoggerManager
[WARNING] Could not find the executable 'mvn' in the path '[]'.
[WARNING] Could not find the executable 'maven' in the path '[]'.
[WARNING] Could not find the executable 'ant' in the path '[]'.
17:18:58,084 WARN  [MetaData.warn](98) No manager for annotations was found in the CLASSPATH so all annotations are ignored.
17:18:58,469 WARN  [MetaData.warn](98) No manager for annotations was found in the CLASSPATH so all annotations are ignored.
[INFO] Build executors:
[INFO]   shell
[INFO]   maven-1
[INFO]   ant
[INFO]   maven2
Tests run: 4, Failures: 0, Errors: 0, Skipped: 0, Time elapsed: 7.108 sec
Running org.apache.maven.continuum.initialization.DefaultContinuumInitializerTest
17:18:59,304 WARN  [PlexusLifecycleBeanPostProcessor.getLoggerManager](104) No loggerManager set in context. Falling back to ConsoleLoggerManager
[WARNING] Could not find the executable 'mvn' in the path '[]'.
[WARNING] Could not find the executable 'maven' in the path '[]'.
[WARNING] Could not find the executable 'ant' in the path '[]'.
17:18:59,814 WARN  [MetaData.warn](98) No manager for annotations was found in the CLASSPATH so all annotations are ignored.
17:19:00,207 WARN  [MetaData.warn](98) No manager for annotations was found in the CLASSPATH so all annotations are ignored.
[INFO] create default AntBuildDefinitionTemplate
[INFO] create Default Schedule
[INFO] create default MavenOneBuildDefinitionTemplate
[INFO] create default MavenTwoBuildDefinitionTemplate
[INFO] create default ShellBuildDefinitionTemplate
[INFO] Continuum initializer running ...
[INFO] create Default Project Group
[INFO] Continuum initializer end running ...
Tests run: 1, Failures: 0, Errors: 0, Skipped: 0, Time elapsed: 1.835 sec
Running org.apache.maven.continuum.project.builder.maven.MavenOneContinuumProjectBuilderTest
17:19:01,113 WARN  [PlexusLifecycleBeanPostProcessor.getLoggerManager](104) No loggerManager set in context. Falling back to ConsoleLoggerManager
[WARNING] Could not find the executable 'mvn' in the path '[]'.
[WARNING] Could not find the executable 'maven' in the path '[]'.
[WARNING] Could not find the executable 'ant' in the path '[]'.
17:19:01,663 WARN  [MetaData.warn](98) No manager for annotations was found in the CLASSPATH so all annotations are ignored.
17:19:02,053 WARN  [MetaData.warn](98) No manager for annotations was found in the CLASSPATH so all annotations are ignored.
[INFO] create default AntBuildDefinitionTemplate
[INFO] create Default Schedule
[INFO] create default MavenOneBuildDefinitionTemplate
[INFO] create default MavenTwoBuildDefinitionTemplate
[INFO] create default ShellBuildDefinitionTemplate
[INFO] Downloading file:/home/continuum/data/working-directory/463/src/test/resources/projects/maven-1.pom.xml
17:19:03,277 WARN  [PlexusLifecycleBeanPostProcessor.getLoggerManager](104) No loggerManager set in context. Falling back to ConsoleLoggerManager
[WARNING] Could not find the executable 'mvn' in the path '[]'.
[WARNING] Could not find the executable 'maven' in the path '[]'.
[WARNING] Could not find the executable 'ant' in the path '[]'.
17:19:03,859 WARN  [MetaData.warn](98) No manager for annotations was found in the CLASSPATH so all annotations are ignored.
17:19:04,183 WARN  [MetaData.warn](98) No manager for annotations was found in the CLASSPATH so all annotations are ignored.
[INFO] create default AntBuildDefinitionTemplate
[INFO] create Default Schedule
[INFO] create default MavenOneBuildDefinitionTemplate
[INFO] create default MavenTwoBuildDefinitionTemplate
[INFO] create default ShellBuildDefinitionTemplate
[INFO] Downloading file:/home/continuum/data/working-directory/463/src/test/resources/projects/maven-1.pom.xml
Tests run: 2, Failures: 0, Errors: 0, Skipped: 0, Time elapsed: 3.921 sec
Running org.apache.maven.continuum.installation.DefaultInstallationServiceTest
17:19:05,105 WARN  [PlexusLifecycleBeanPostProcessor.getLoggerManager](104) No loggerManager set in context. Falling back to ConsoleLoggerManager
[WARNING] Could not find the executable 'mvn' in the path '[]'.
[WARNING] Could not find the executable 'maven' in the path '[]'.
[WARNING] Could not find the executable 'ant' in the path '[]'.
17:19:05,621 WARN  [MetaData.warn](98) No manager for annotations was found in the CLASSPATH so all annotations are ignored.
17:19:06,009 WARN  [MetaData.warn](98) No manager for annotations was found in the CLASSPATH so all annotations are ignored.
17:19:06,855 WARN  [PlexusLifecycleBeanPostProcessor.getLoggerManager](104) No loggerManager set in context. Falling back to ConsoleLoggerManager
[WARNING] Could not find the executable 'mvn' in the path '[]'.
[WARNING] Could not find the executable 'maven' in the path '[]'.
[WARNING] Could not find the executable 'ant' in the path '[]'.
17:19:07,343 WARN  [MetaData.warn](98) No manager for annotations was found in the CLASSPATH so all annotations are ignored.
17:19:07,732 WARN  [MetaData.warn](98) No manager for annotations was found in the CLASSPATH so all annotations are ignored.
17:19:08,609 WARN  [PlexusLifecycleBeanPostProcessor.getLoggerManager](104) No loggerManager set in context. Falling back to ConsoleLoggerManager
[WARNING] Could not find the executable 'mvn' in the path '[]'.
[WARNING] Could not find the executable 'maven' in the path '[]'.
[WARNING] Could not find the executable 'ant' in the path '[]'.
17:19:09,170 WARN  [MetaData.warn](98) No manager for annotations was found in the CLASSPATH so all annotations are ignored.
17:19:09,567 WARN  [MetaData.warn](98) No manager for annotations was found in the CLASSPATH so all annotations are ignored.
17:19:10,380 WARN  [PlexusLifecycleBeanPostProcessor.getLoggerManager](104) No loggerManager set in context. Falling back to ConsoleLoggerManager
[WARNING] Could not find the executable 'mvn' in the path '[]'.
[WARNING] Could not find the executable 'maven' in the path '[]'.
[WARNING] Could not find the executable 'ant' in the path '[]'.
17:19:11,003 WARN  [MetaData.warn](98) No manager for annotations was found in the CLASSPATH so all annotations are ignored.
17:19:11,775 WARN  [MetaData.warn](98) No manager for annotations was found in the CLASSPATH so all annotations are ignored.
17:19:13,012 WARN  [PlexusLifecycleBeanPostProcessor.getLoggerManager](104) No loggerManager set in context. Falling back to ConsoleLoggerManager
[WARNING] Could not find the executable 'mvn' in the path '[]'.
[WARNING] Could not find the executable 'maven' in the path '[]'.
[WARNING] Could not find the executable 'ant' in the path '[]'.
17:19:13,603 WARN  [MetaData.warn](98) No manager for annotations was found in the CLASSPATH so all annotations are ignored.
17:19:14,030 WARN  [MetaData.warn](98) No manager for annotations was found in the CLASSPATH so all annotations are ignored.
17:19:15,443 WARN  [PlexusLifecycleBeanPostProcessor.getLoggerManager](104) No loggerManager set in context. Falling back to ConsoleLoggerManager
[WARNING] Could not find the executable 'mvn' in the path '[]'.
[WARNING] Could not find the executable 'maven' in the path '[]'.
[WARNING] Could not find the executable 'ant' in the path '[]'.
17:19:16,089 WARN  [MetaData.warn](98) No manager for annotations was found in the CLASSPATH so all annotations are ignored.
17:19:16,455 WARN  [MetaData.warn](98) No manager for annotations was found in the CLASSPATH so all annotations are ignored.
[java version "1.6.0_05", Java(TM) SE Runtime Environment (build 1.6.0_05-b13), Java HotSpot(TM) Client VM (build 10.0-b19, mixed mode, sharing)]
17:19:17,584 WARN  [PlexusLifecycleBeanPostProcessor.getLoggerManager](104) No loggerManager set in context. Falling back to ConsoleLoggerManager
[WARNING] Could not find the executable 'mvn' in the path '[]'.
[WARNING] Could not find the executable 'maven' in the path '[]'.
[WARNING] Could not find the executable 'ant' in the path '[]'.
17:19:18,195 WARN  [MetaData.warn](98) No manager for annotations was found in the CLASSPATH so all annotations are ignored.
17:19:18,560 WARN  [MetaData.warn](98) No manager for annotations was found in the CLASSPATH so all annotations are ignored.
17:19:20,117 WARN  [PlexusLifecycleBeanPostProcessor.getLoggerManager](104) No loggerManager set in context. Falling back to ConsoleLoggerManager
[WARNING] Could not find the executable 'mvn' in the path '[]'.
[WARNING] Could not find the executable 'maven' in the path '[]'.
[WARNING] Could not find the executable 'ant' in the path '[]'.
17:19:20,740 WARN  [MetaData.warn](98) No manager for annotations was found in the CLASSPATH so all annotations are ignored.
17:19:21,152 WARN  [MetaData.warn](98) No manager for annotations was found in the CLASSPATH so all annotations are ignored.
17:19:21,990 WARN  [PlexusLifecycleBeanPostProcessor.getLoggerManager](104) No loggerManager set in context. Falling back to ConsoleLoggerManager
[WARNING] Could not find the executable 'mvn' in the path '[]'.
[WARNING] Could not find the executable 'maven' in the path '[]'.
[WARNING] Could not find the executable 'ant' in the path '[]'.
17:19:22,596 WARN  [MetaData.warn](98) No manager for annotations was found in the CLASSPATH so all annotations are ignored.
17:19:23,007 WARN  [MetaData.warn](98) No manager for annotations was found in the CLASSPATH so all annotations are ignored.
Tests run: 9, Failures: 0, Errors: 0, Skipped: 0, Time elapsed: 18.751 sec
Running org.apache.maven.continuum.notification.mail.FormatterToolTest
Tests run: 1, Failures: 0, Errors: 0, Skipped: 0, Time elapsed: 0.004 sec
Running org.apache.maven.continuum.core.action.CreateProjectsFromMetadataTest
[INFO] checking for settings auth setup
[INFO] checking for settings auth setup
Tests run: 2, Failures: 0, Errors: 0, Skipped: 0, Time elapsed: 0.586 sec
Running org.apache.maven.continuum.execution.manager.DefaultBuildExecutorManagerTest
17:19:24,512 WARN  [PlexusLifecycleBeanPostProcessor.getLoggerManager](104) No loggerManager set in context. Falling back to ConsoleLoggerManager
[WARNING] Could not find the executable 'mvn' in the path '[]'.
[WARNING] Could not find the executable 'maven' in the path '[]'.
[WARNING] Could not find the executable 'ant' in the path '[]'.
17:19:25,746 WARN  [MetaData.warn](98) No manager for annotations was found in the CLASSPATH so all annotations are ignored.
17:19:26,135 WARN  [MetaData.warn](98) No manager for annotations was found in the CLASSPATH so all annotations are ignored.
[INFO] Build executors:
[INFO]   shell
[INFO]   maven-1
[INFO]   ant
[INFO]   maven2
Tests run: 1, Failures: 0, Errors: 0, Skipped: 0, Time elapsed: 2.511 sec

Results :

Tests run: 63, Failures: 0, Errors: 0, Skipped: 0

[INFO] Stopping Continuum.
[INFO] Continuum stopped.
[INFO] [INFO] Stopping Continuum.
[INFO] Continuum stopped.
Stopping Continuum.
[INFO] Continuum stopped.
[INFO] [INFO] Stopping Continuum.
[INFO] Continuum stopped.
Stopping Continuum.
[INFO] Continuum stopped.
[INFO] Stopping Continuum.
[INFO] Continuum stopped.
[INFO] Stopping Continuum.
[INFO] Continuum stopped.
[INFO] Stopping Continuum.
[INFO] Continuum stopped.
[INFO] Stopping Continuum.
[INFO] Continuum stopped.
[INFO] Stopping Continuum.
[INFO] Continuum stopped.
[INFO] Stopping Continuum.
[INFO] Continuum stopped.
[INFO] Stopping Continuum.
[INFO] Continuum stopped.
[INFO] Stopping Continuum.
[INFO] Continuum stopped.
[INFO] [jar:jar]
[INFO] Building jar: /home/continuum/data/working-directory/463/target/continuum-core-1.2-SNAPSHOT.jar
[INFO] [install:install]
[INFO] Installing /home/continuum/data/working-directory/463/target/continuum-core-1.2-SNAPSHOT.jar to /home/continuum/.m2/repository/org/apache/continuum/continuum-core/1.2-SNAPSHOT/continuum-core-1.2-SNAPSHOT.jar
[INFO] ------------------------------------------------------------------------
[INFO] BUILD SUCCESSFUL
[INFO] ------------------------------------------------------------------------
[INFO] Total time: 2 minutes 32 seconds
[INFO] Finished at: Wed Apr 30 17:19:27 PDT 2008
[INFO] Final Memory: 37M/63M
[INFO] ------------------------------------------------------------------------

****************************************************************************



Mime
View raw message