continuum-notifications mailing list archives

Site index · List index
Message view « Date » · « Thread »
Top « Date » · « Thread »
From Continuum VMBuild Server <contin...@apache.org>
Subject [continuum] BUILD SUCCESSFUL: Continuum Core
Date Thu, 08 May 2008 05:21:28 GMT
Online report : http://vmbuild.apache.org/continuum/buildResult.action?buildId=87855&projectId=463

Build statistics:
  State: Ok
  Previous State: Failed
  Started at: Wed 7 May 2008 22:18:03 -0700
  Finished at: Wed 7 May 2008 22:21:16 -0700
  Total time: 3m 13s
  Build Trigger: Forced
  Build Number: 58
  Exit code: 0
  Building machine hostname: vmbuild.apache.org
  Operating system : Linux(unknown)
  Java Home version : 
          java version "1.6.0_05"
          Java(TM) SE Runtime Environment (build 1.6.0_05-b13)
          Java HotSpot(TM) Client VM (build 10.0-b19, mixed mode, sharing)
        
  Builder version :
          Maven version: 2.0.7
          Java version: 1.6.0_05
          OS name: "linux" version: "2.6.20-16-server" arch: "i386"
    
****************************************************************************
SCM Changes:
****************************************************************************
No files changed

****************************************************************************
Dependencies Changes:
****************************************************************************
org.apache.continuum:continuum-scm:1.2-SNAPSHOT


****************************************************************************
Build Defintion:
****************************************************************************
POM filename: pom.xml
Goals: clean install   
Arguments: --batch-mode --non-recursive
Build Fresh: false
Always Build: false
Default Build Definition: true
Schedule: DEFAULT_SCHEDULE
Description: $build.buildDefinition.description


****************************************************************************
Test Summary:
****************************************************************************
Tests: 64
Failures: 0
Total time: 160693

****************************************************************************
Output:
****************************************************************************
[INFO] Scanning for projects...
[INFO] ----------------------------------------------------------------------------
[INFO] Building Continuum Core
[INFO]    task-segment: [clean, install]
[INFO] ----------------------------------------------------------------------------
[INFO] [clean:clean]
[INFO] Deleting directory /home/continuum/data/working-directory/463/target
[INFO] Deleting directory /home/continuum/data/working-directory/463/target/classes
[INFO] Deleting directory /home/continuum/data/working-directory/463/target/test-classes
[INFO] Deleting directory /home/continuum/data/working-directory/463/target/site
[INFO] [buildnumber:create {execution: default}]
[INFO] Checking for local modifications: skipped.
[INFO] Updating project files from SCM: skipped.
[INFO] Storing buildNumber: 654419 at timestamp: 1210223891789
[INFO] [plexus:descriptor {execution: generate}]
[WARNING] Component: MavenTwoContinuumProjectBuilder, field name: 'excludedPackagingTypes': Currently configurable fields will not be written to the descriptor without a default value.
[INFO] snapshot org.apache.continuum:continuum-base:1.2-SNAPSHOT: checking for updates from codehaus.org
[INFO] snapshot org.apache.continuum:continuum-base:1.2-SNAPSHOT: checking for updates from people.apache.org
[INFO] snapshot org.apache.continuum:continuum-base:1.2-SNAPSHOT: checking for updates from apache.snapshots
[INFO] Setting property: classpath.resource.loader.class => 'org.codehaus.plexus.velocity.ContextClassLoaderResourceLoader'.
[INFO] Setting property: velocimacro.messages.on => 'false'.
[INFO] Setting property: resource.loader => 'classpath'.
[INFO] Setting property: resource.manager.logwhenfound => 'false'.
[INFO] [remote-resources:process {execution: default}]
[INFO] [resources:resources]
[INFO] Using default encoding to copy filtered resources.
[INFO] [plexus:merge-descriptors {execution: merge}]
[INFO] [compiler:compile]
[INFO] Compiling 77 source files to /home/continuum/data/working-directory/463/target/classes
[INFO] [resources:testResources]
[INFO] Using default encoding to copy filtered resources.
[INFO] [compiler:testCompile]
[INFO] Compiling 19 source files to /home/continuum/data/working-directory/463/target/test-classes
[INFO] [surefire:test]
[INFO] Surefire report directory: /home/continuum/data/working-directory/463/target/surefire-reports

-------------------------------------------------------
 T E S T S
-------------------------------------------------------
Running org.apache.maven.continuum.notification.mail.MailContinuumNotifierTest
22:18:41,013 WARN  [PlexusLifecycleBeanPostProcessor.getLoggerManager](104) No loggerManager set in context. Falling back to ConsoleLoggerManager
[WARNING] Could not find the executable 'mvn' in the path '[]'.
[WARNING] Could not find the executable 'maven' in the path '[]'.
[WARNING] Could not find the executable 'ant' in the path '[]'.
22:18:43,990 WARN  [MetaData.warn](98) No manager for annotations was found in the CLASSPATH so all annotations are ignored.
22:18:44,764 WARN  [MetaData.warn](98) No manager for annotations was found in the CLASSPATH so all annotations are ignored.
[INFO] create default AntBuildDefinitionTemplate
[INFO] create Default Schedule
[INFO] create default MavenOneBuildDefinitionTemplate
[INFO] create default MavenTwoBuildDefinitionTemplate
[INFO] create default ShellBuildDefinitionTemplate
[INFO] Build executors:
[INFO]   shell
[INFO]   maven-1
[INFO]   ant
[INFO]   maven2
[INFO] Initializing Continuum.
[INFO] Showing all projects: 
[INFO] Starting Continuum.
[INFO] 
[INFO] 
[INFO] < Continuum unknown started! >
[INFO] ------------------------------
[INFO]        \   ^__^
[INFO]         \  (oo)\_______
[INFO]            (__)\       )\/\
[INFO]                ||----w |
[INFO]                ||     ||
[INFO] 
[INFO] 
[INFO] Continuum initializer running ...
[INFO] Default Project Group exists
[INFO] Continuum initializer end running ...
[INFO] Activating schedules ...
[INFO] DEFAULT_SCHEDULE: next fire time ->Wed May 07 23:00:00 PDT 2008
[INFO] Using 'continuum@localhost' as the from mailbox for all emails.
[INFO] From name: Continuum
[INFO] Build host name: vmbuild.apache.org
[INFO] Message Subject: '[continuum] BUILD SUCCESSFUL: foo.bar Test Project'.
[INFO] Sending message: From '"Continuum" <continuum@localhost>'.
[INFO] Recipient: To '<foo@bar>'.
Online report : /buildResult.action?buildId=17&projectId=0

Build statistics:
  State: Ok
  Previous Build: No previous build.
  Started at: Wed, 7 May 2008 22:18:45 -0700
  Finished at: Wed, 7 May 2008 22:39:20 -0700
  Total time: 20m 34s
  Build Trigger: Forced
  Build Number: 0
  Exit code: 10
  Building machine hostname: vmbuild.apache.org
  Operating system : Linux(unknown)
  Java Home version : 
          java version "1.6.0_05"
          Java(TM) SE Runtime Environment (build 1.6.0_05-b13)
          Java HotSpot(TM) Client VM (build 10.0-b19, mixed mode, sharing)
        
  Builder version :
          Maven version: 2.0.7
          Java version: 1.6.0_05
          OS name: "linux" version: "2.6.20-16-server" arch: "i386"
    
****************************************************************************
Dependencies Changes:
****************************************************************************
No dependencies changed



****************************************************************************
Test Summary:
****************************************************************************
Tests: 0
Failures: 0
Total time: 0.0




22:18:50,080 WARN  [PlexusLifecycleBeanPostProcessor.getLoggerManager](104) No loggerManager set in context. Falling back to ConsoleLoggerManager
[WARNING] Could not find the executable 'mvn' in the path '[]'.
[WARNING] Could not find the executable 'maven' in the path '[]'.
[WARNING] Could not find the executable 'ant' in the path '[]'.
22:18:50,835 WARN  [MetaData.warn](98) No manager for annotations was found in the CLASSPATH so all annotations are ignored.
22:18:51,273 WARN  [MetaData.warn](98) No manager for annotations was found in the CLASSPATH so all annotations are ignored.
[INFO] create default AntBuildDefinitionTemplate
[INFO] create Default Schedule
[INFO] create default MavenOneBuildDefinitionTemplate
[INFO] create default MavenTwoBuildDefinitionTemplate
[INFO] create default ShellBuildDefinitionTemplate
[INFO] Build executors:
[INFO]   shell
[INFO]   maven-1
[INFO]   ant
[INFO]   maven2
[INFO] Initializing Continuum.
[INFO] Showing all projects: 
[INFO] Starting Continuum.
[INFO] 
[INFO] 
[INFO] < Continuum unknown started! >
[INFO] ------------------------------
[INFO]        \   ^__^
[INFO]         \  (oo)\_______
[INFO]            (__)\       )\/\
[INFO]                ||----w |
[INFO]                ||     ||
[INFO] 
[INFO] 
[INFO] Continuum initializer running ...
[INFO] Default Project Group exists
[INFO] Continuum initializer end running ...
[INFO] Activating schedules ...
[WARNING] Will not schedule this job as a job {DEFAULT_SCHEDULE:DEFAULT} already exists.
[INFO] DEFAULT_SCHEDULE: next fire time ->null
[INFO] Using 'continuum@localhost' as the from mailbox for all emails.
[INFO] From name: Continuum
[INFO] Build host name: vmbuild.apache.org
[INFO] Message Subject: '[continuum] BUILD FAILURE: foo.bar Test Project'.
[INFO] Sending message: From '"Continuum" <continuum@localhost>'.
[INFO] Recipient: To '<foo@bar>'.
Online report : /buildResult.action?buildId=17&projectId=0

Build statistics:
  State: Failed
  Previous Build: No previous build.
  Started at: Wed, 7 May 2008 22:18:51 -0700
  Finished at: Wed, 7 May 2008 22:39:26 -0700
  Total time: 20m 34s
  Build Trigger: Forced
  Build Number: 0
  Exit code: 10
  Building machine hostname: vmbuild.apache.org
  Operating system : Linux(unknown)
  Java Home version : 
          java version "1.6.0_05"
          Java(TM) SE Runtime Environment (build 1.6.0_05-b13)
          Java HotSpot(TM) Client VM (build 10.0-b19, mixed mode, sharing)
        
  Builder version :
          Maven version: 2.0.7
          Java version: 1.6.0_05
          OS name: "linux" version: "2.6.20-16-server" arch: "i386"
    
****************************************************************************
Dependencies Changes:
****************************************************************************
No dependencies changed



****************************************************************************
Test Summary:
****************************************************************************
Tests: 0
Failures: 0
Total time: 0.0




22:18:53,581 WARN  [PlexusLifecycleBeanPostProcessor.getLoggerManager](104) No loggerManager set in context. Falling back to ConsoleLoggerManager
[WARNING] Could not find the executable 'mvn' in the path '[]'.
[WARNING] Could not find the executable 'maven' in the path '[]'.
[WARNING] Could not find the executable 'ant' in the path '[]'.
22:18:53,977 WARN  [MetaData.warn](98) No manager for annotations was found in the CLASSPATH so all annotations are ignored.
22:18:54,449 WARN  [MetaData.warn](98) No manager for annotations was found in the CLASSPATH so all annotations are ignored.
[INFO] create default AntBuildDefinitionTemplate
[INFO] create Default Schedule
[INFO] create default MavenOneBuildDefinitionTemplate
[INFO] create default MavenTwoBuildDefinitionTemplate
[INFO] create default ShellBuildDefinitionTemplate
[INFO] Build executors:
[INFO]   shell
[INFO]   maven-1
[INFO]   ant
[INFO]   maven2
[INFO] Initializing Continuum.
[INFO] Showing all projects: 
[INFO] Starting Continuum.
[INFO] 
[INFO] 
[INFO] < Continuum unknown started! >
[INFO] ------------------------------
[INFO]        \   ^__^
[INFO]         \  (oo)\_______
[INFO]            (__)\       )\/\
[INFO]                ||----w |
[INFO]                ||     ||
[INFO] 
[INFO] 
[INFO] Continuum initializer running ...
[INFO] Default Project Group exists
[INFO] Continuum initializer end running ...
[INFO] Activating schedules ...
[WARNING] Will not schedule this job as a job {DEFAULT_SCHEDULE:DEFAULT} already exists.
[INFO] DEFAULT_SCHEDULE: next fire time ->null
[INFO] Using 'continuum@localhost' as the from mailbox for all emails.
[INFO] From name: Continuum
[INFO] Build host name: vmbuild.apache.org
[INFO] Message Subject: '[continuum] BUILD ERROR: foo.bar Test Project'.
[INFO] Sending message: From '"Continuum" <continuum@localhost>'.
[INFO] Recipient: To '<foo@bar>'.
Tests run: 3, Failures: 0, Errors: 0, Skipped: 0, Time elapsed: 22.502 sec
Running org.apache.maven.continuum.utils.ProjectSorterTest
Tests run: 2, Failures: 0, Errors: 0, Skipped: 0, Time elapsed: 0.02 sec
Running org.apache.maven.continuum.execution.AbstractContinuumBuildExecutorTest
Online report : /buildResult.action?buildId=17&projectId=0

Build statistics:
  State: Error
  Previous Build: No previous build.
  Started at: Wed, 7 May 2008 22:18:55 -0700
  Finished at: Wed, 7 May 2008 22:39:29 -0700
  Total time: 20m 34s
  Build Trigger: Forced
  Build Number: 0
  Exit code: 10
  Building machine hostname: vmbuild.apache.org
  Operating system : Linux(unknown)
  Java Home version : 
          java version "1.6.0_05"
          Java(TM) SE Runtime Environment (build 1.6.0_05-b13)
          Java HotSpot(TM) Client VM (build 10.0-b19, mixed mode, sharing)
        
  Builder version :
          Maven version: 2.0.7
          Java version: 1.6.0_05
          OS name: "linux" version: "2.6.20-16-server" arch: "i386"
    
****************************************************************************
Dependencies Changes:
****************************************************************************
No dependencies changed



****************************************************************************
Test Summary:
****************************************************************************
Tests: 0
Failures: 0
Total time: 0.0

****************************************************************************
Build Error:
****************************************************************************
Big long error message




[INFO] Exit code: 0
Tests run: 1, Failures: 0, Errors: 0, Skipped: 0, Time elapsed: 0.114 sec
Running org.apache.maven.continuum.buildqueue.BuildQueueTest
22:18:57,008 WARN  [PlexusLifecycleBeanPostProcessor.getLoggerManager](104) No loggerManager set in context. Falling back to ConsoleLoggerManager
[WARNING] Could not find the executable 'mvn' in the path '[]'.
[WARNING] Could not find the executable 'maven' in the path '[]'.
[WARNING] Could not find the executable 'ant' in the path '[]'.
22:18:57,439 WARN  [MetaData.warn](98) No manager for annotations was found in the CLASSPATH so all annotations are ignored.
22:18:58,006 WARN  [MetaData.warn](98) No manager for annotations was found in the CLASSPATH so all annotations are ignored.
22:18:59,496 WARN  [PlexusLifecycleBeanPostProcessor.getLoggerManager](104) No loggerManager set in context. Falling back to ConsoleLoggerManager
[WARNING] Could not find the executable 'mvn' in the path '[]'.
[WARNING] Could not find the executable 'maven' in the path '[]'.
[WARNING] Could not find the executable 'ant' in the path '[]'.
22:18:59,946 WARN  [MetaData.warn](98) No manager for annotations was found in the CLASSPATH so all annotations are ignored.
22:19:00,374 WARN  [MetaData.warn](98) No manager for annotations was found in the CLASSPATH so all annotations are ignored.
22:19:01,643 WARN  [PlexusLifecycleBeanPostProcessor.getLoggerManager](104) No loggerManager set in context. Falling back to ConsoleLoggerManager
[WARNING] Could not find the executable 'mvn' in the path '[]'.
[WARNING] Could not find the executable 'maven' in the path '[]'.
[WARNING] Could not find the executable 'ant' in the path '[]'.
22:19:02,035 WARN  [MetaData.warn](98) No manager for annotations was found in the CLASSPATH so all annotations are ignored.
22:19:02,492 WARN  [MetaData.warn](98) No manager for annotations was found in the CLASSPATH so all annotations are ignored.
Tests run: 3, Failures: 0, Errors: 0, Skipped: 0, Time elapsed: 7.097 sec
Running org.apache.maven.continuum.TestAction
Tests run: 0, Failures: 0, Errors: 0, Skipped: 0, Time elapsed: 0.004 sec
Running org.apache.maven.continuum.project.builder.maven.MavenTwoContinuumProjectBuilderTest
22:19:03,893 WARN  [PlexusLifecycleBeanPostProcessor.getLoggerManager](104) No loggerManager set in context. Falling back to ConsoleLoggerManager
[WARNING] Could not find the executable 'mvn' in the path '[]'.
[WARNING] Could not find the executable 'maven' in the path '[]'.
[WARNING] Could not find the executable 'ant' in the path '[]'.
22:19:04,373 WARN  [MetaData.warn](98) No manager for annotations was found in the CLASSPATH so all annotations are ignored.
22:19:04,818 WARN  [MetaData.warn](98) No manager for annotations was found in the CLASSPATH so all annotations are ignored.
[INFO] create default AntBuildDefinitionTemplate
[INFO] create Default Schedule
[INFO] create default MavenOneBuildDefinitionTemplate
[INFO] create default MavenTwoBuildDefinitionTemplate
[INFO] create default ShellBuildDefinitionTemplate
[INFO] Downloading file:/home/continuum/data/working-directory/463/src/test/repository/maven-builder-helper-1.xml
22:19:06,271 WARN  [PlexusLifecycleBeanPostProcessor.getLoggerManager](104) No loggerManager set in context. Falling back to ConsoleLoggerManager
[WARNING] Could not find the executable 'mvn' in the path '[]'.
[WARNING] Could not find the executable 'maven' in the path '[]'.
[WARNING] Could not find the executable 'ant' in the path '[]'.
22:19:07,134 WARN  [MetaData.warn](98) No manager for annotations was found in the CLASSPATH so all annotations are ignored.
22:19:07,506 WARN  [MetaData.warn](98) No manager for annotations was found in the CLASSPATH so all annotations are ignored.
[INFO] create default AntBuildDefinitionTemplate
[INFO] create Default Schedule
[INFO] create default MavenOneBuildDefinitionTemplate
[INFO] create default MavenTwoBuildDefinitionTemplate
[INFO] create default ShellBuildDefinitionTemplate
[INFO] Downloading file:/home/continuum/data/working-directory/463/src/test/repository/maven-builder-helper-2.xml
22:19:08,751 WARN  [PlexusLifecycleBeanPostProcessor.getLoggerManager](104) No loggerManager set in context. Falling back to ConsoleLoggerManager
[WARNING] Could not find the executable 'mvn' in the path '[]'.
[WARNING] Could not find the executable 'maven' in the path '[]'.
[WARNING] Could not find the executable 'ant' in the path '[]'.
22:19:09,193 WARN  [MetaData.warn](98) No manager for annotations was found in the CLASSPATH so all annotations are ignored.
22:19:09,614 WARN  [MetaData.warn](98) No manager for annotations was found in the CLASSPATH so all annotations are ignored.
[INFO] create default AntBuildDefinitionTemplate
[INFO] create Default Schedule
[INFO] create default MavenOneBuildDefinitionTemplate
[INFO] create default MavenTwoBuildDefinitionTemplate
[INFO] create default ShellBuildDefinitionTemplate
[INFO] Downloading file:/home/continuum/data/working-directory/463/src/test/repository/maven-builder-helper-3.xml
22:19:10,958 WARN  [PlexusLifecycleBeanPostProcessor.getLoggerManager](104) No loggerManager set in context. Falling back to ConsoleLoggerManager
[WARNING] Could not find the executable 'mvn' in the path '[]'.
[WARNING] Could not find the executable 'maven' in the path '[]'.
[WARNING] Could not find the executable 'ant' in the path '[]'.
22:19:11,771 WARN  [MetaData.warn](98) No manager for annotations was found in the CLASSPATH so all annotations are ignored.
22:19:12,136 WARN  [MetaData.warn](98) No manager for annotations was found in the CLASSPATH so all annotations are ignored.
[INFO] create default AntBuildDefinitionTemplate
[INFO] create Default Schedule
[INFO] create default MavenOneBuildDefinitionTemplate
[INFO] create default MavenTwoBuildDefinitionTemplate
[INFO] create default ShellBuildDefinitionTemplate
[INFO] Downloading file:/home/continuum/data/working-directory/463/target/test-classes/projects/continuum/pom.xml
[INFO] Downloading file:/home/continuum/data/working-directory/463/target/test-classes/projects/continuum/continuum-core/pom.xml
[INFO] Downloading file:/home/continuum/data/working-directory/463/target/test-classes/projects/continuum/continuum-model/pom.xml
[INFO] Downloading file:/home/continuum/data/working-directory/463/target/test-classes/projects/continuum/continuum-plexus-application/pom.xml
[INFO] Downloading file:/home/continuum/data/working-directory/463/target/test-classes/projects/continuum/continuum-web/pom.xml
[INFO] Downloading file:/home/continuum/data/working-directory/463/target/test-classes/projects/continuum/continuum-xmlrpc/pom.xml
[INFO] Downloading file:/home/continuum/data/working-directory/463/target/test-classes/projects/continuum/continuum-notifiers/pom.xml
[INFO] Downloading file:/home/continuum/data/working-directory/463/target/test-classes/projects/continuum/continuum-notifiers/continuum-notifier-irc/pom.xml
[INFO] Downloading file:/home/continuum/data/working-directory/463/target/test-classes/projects/continuum/continuum-notifiers/continuum-notifier-jabber/pom.xml
[INFO] Downloading file:/home/continuum/data/working-directory/463/target/test-classes/projects/continuum/I'm-not-here-project/pom.xml
22:19:14,835 WARN  [PlexusLifecycleBeanPostProcessor.getLoggerManager](104) No loggerManager set in context. Falling back to ConsoleLoggerManager
[WARNING] Could not find the executable 'mvn' in the path '[]'.
[WARNING] Could not find the executable 'maven' in the path '[]'.
[WARNING] Could not find the executable 'ant' in the path '[]'.
22:19:15,304 WARN  [MetaData.warn](98) No manager for annotations was found in the CLASSPATH so all annotations are ignored.
22:19:15,799 WARN  [MetaData.warn](98) No manager for annotations was found in the CLASSPATH so all annotations are ignored.
[INFO] create default AntBuildDefinitionTemplate
[INFO] create Default Schedule
[INFO] create default MavenOneBuildDefinitionTemplate
[INFO] create default MavenTwoBuildDefinitionTemplate
[INFO] create default ShellBuildDefinitionTemplate
[INFO] Downloading file:/home/continuum/data/working-directory/463/target/test-classes/projects/continuum/pom_ci.xml
[INFO] Downloading file:/home/continuum/data/working-directory/463/target/test-classes/projects/continuum/continuum-core/pom.xml
[INFO] Downloading file:/home/continuum/data/working-directory/463/target/test-classes/projects/continuum/continuum-model/pom.xml
[INFO] Downloading file:/home/continuum/data/working-directory/463/target/test-classes/projects/continuum/continuum-plexus-application/pom.xml
[INFO] Downloading file:/home/continuum/data/working-directory/463/target/test-classes/projects/continuum/continuum-web/pom.xml
[INFO] Downloading file:/home/continuum/data/working-directory/463/target/test-classes/projects/continuum/continuum-xmlrpc/pom.xml
[INFO] Downloading file:/home/continuum/data/working-directory/463/target/test-classes/projects/continuum/continuum-notifiers/pom.xml
[INFO] Downloading file:/home/continuum/data/working-directory/463/target/test-classes/projects/continuum/continuum-notifiers/continuum-notifier-irc/pom.xml
[INFO] Downloading file:/home/continuum/data/working-directory/463/target/test-classes/projects/continuum/continuum-notifiers/continuum-notifier-jabber/pom.xml
[INFO] Downloading file:/home/continuum/data/working-directory/463/target/test-classes/projects/continuum/I'm-not-here-project/pom.xml
22:19:18,387 WARN  [PlexusLifecycleBeanPostProcessor.getLoggerManager](104) No loggerManager set in context. Falling back to ConsoleLoggerManager
[WARNING] Could not find the executable 'mvn' in the path '[]'.
[WARNING] Could not find the executable 'maven' in the path '[]'.
[WARNING] Could not find the executable 'ant' in the path '[]'.
22:19:18,859 WARN  [MetaData.warn](98) No manager for annotations was found in the CLASSPATH so all annotations are ignored.
22:19:19,287 WARN  [MetaData.warn](98) No manager for annotations was found in the CLASSPATH so all annotations are ignored.
[INFO] create default AntBuildDefinitionTemplate
[INFO] create Default Schedule
[INFO] create default MavenOneBuildDefinitionTemplate
[INFO] create default MavenTwoBuildDefinitionTemplate
[INFO] create default ShellBuildDefinitionTemplate
[INFO] Downloading file:/home/continuum/data/working-directory/463/target/test-classes/projects/continuum/continuum-core/pom.xml
Tests run: 6, Failures: 0, Errors: 0, Skipped: 0, Time elapsed: 16.789 sec
Running org.apache.maven.continuum.builddefinition.DefaultBuildDefinitionServiceTest
22:19:20,604 WARN  [PlexusLifecycleBeanPostProcessor.getLoggerManager](104) No loggerManager set in context. Falling back to ConsoleLoggerManager
[WARNING] Could not find the executable 'mvn' in the path '[]'.
[WARNING] Could not find the executable 'maven' in the path '[]'.
[WARNING] Could not find the executable 'ant' in the path '[]'.
22:19:21,099 WARN  [MetaData.warn](98) No manager for annotations was found in the CLASSPATH so all annotations are ignored.
22:19:21,535 WARN  [MetaData.warn](98) No manager for annotations was found in the CLASSPATH so all annotations are ignored.
[INFO] create default AntBuildDefinitionTemplate
[INFO] create Default Schedule
[INFO] create default MavenOneBuildDefinitionTemplate
[INFO] create default MavenTwoBuildDefinitionTemplate
[INFO] create default ShellBuildDefinitionTemplate
22:19:25,235 WARN  [PlexusLifecycleBeanPostProcessor.getLoggerManager](104) No loggerManager set in context. Falling back to ConsoleLoggerManager
[WARNING] Could not find the executable 'mvn' in the path '[]'.
[WARNING] Could not find the executable 'maven' in the path '[]'.
[WARNING] Could not find the executable 'ant' in the path '[]'.
22:19:25,911 WARN  [MetaData.warn](98) No manager for annotations was found in the CLASSPATH so all annotations are ignored.
22:19:26,329 WARN  [MetaData.warn](98) No manager for annotations was found in the CLASSPATH so all annotations are ignored.
[INFO] create default AntBuildDefinitionTemplate
[INFO] create Default Schedule
[INFO] create default MavenOneBuildDefinitionTemplate
[INFO] create default MavenTwoBuildDefinitionTemplate
[INFO] create default ShellBuildDefinitionTemplate
22:19:27,733 WARN  [PlexusLifecycleBeanPostProcessor.getLoggerManager](104) No loggerManager set in context. Falling back to ConsoleLoggerManager
[WARNING] Could not find the executable 'mvn' in the path '[]'.
[WARNING] Could not find the executable 'maven' in the path '[]'.
[WARNING] Could not find the executable 'ant' in the path '[]'.
22:19:28,454 WARN  [MetaData.warn](98) No manager for annotations was found in the CLASSPATH so all annotations are ignored.
22:19:29,010 WARN  [MetaData.warn](98) No manager for annotations was found in the CLASSPATH so all annotations are ignored.
[INFO] create default AntBuildDefinitionTemplate
[INFO] create Default Schedule
[INFO] create default MavenOneBuildDefinitionTemplate
[INFO] create default MavenTwoBuildDefinitionTemplate
[INFO] create default ShellBuildDefinitionTemplate
Tests run: 3, Failures: 0, Errors: 0, Skipped: 0, Time elapsed: 9.571 sec
Running org.apache.maven.continuum.DefaultContinuumTest
22:19:30,353 WARN  [PlexusLifecycleBeanPostProcessor.getLoggerManager](104) No loggerManager set in context. Falling back to ConsoleLoggerManager
[WARNING] Could not find the executable 'mvn' in the path '[]'.
[WARNING] Could not find the executable 'maven' in the path '[]'.
[WARNING] Could not find the executable 'ant' in the path '[]'.
22:19:30,921 WARN  [MetaData.warn](98) No manager for annotations was found in the CLASSPATH so all annotations are ignored.
22:19:31,292 WARN  [MetaData.warn](98) No manager for annotations was found in the CLASSPATH so all annotations are ignored.
[INFO] create default AntBuildDefinitionTemplate
[INFO] create Default Schedule
[INFO] create default MavenOneBuildDefinitionTemplate
[INFO] create default MavenTwoBuildDefinitionTemplate
[INFO] create default ShellBuildDefinitionTemplate
[INFO] Build executors:
[INFO]   shell
[INFO]   maven-1
[INFO]   ant
[INFO]   maven2
[INFO] Initializing Continuum.
[INFO] Showing all projects: 
[INFO] Starting Continuum.
[INFO] 
[INFO] 
[INFO] < Continuum unknown started! >
[INFO] ------------------------------
[INFO]        \   ^__^
[INFO]         \  (oo)\_______
[INFO]            (__)\       )\/\
[INFO]                ||----w |
[INFO]                ||     ||
[INFO] 
[INFO] 
[INFO] Continuum initializer running ...
[INFO] Default Project Group exists
[INFO] Continuum initializer end running ...
[INFO] Activating schedules ...
[WARNING] Will not schedule this job as a job {DEFAULT_SCHEDULE:DEFAULT} already exists.
[INFO] DEFAULT_SCHEDULE: next fire time ->null
22:19:33,223 WARN  [PlexusLifecycleBeanPostProcessor.getLoggerManager](104) No loggerManager set in context. Falling back to ConsoleLoggerManager
[WARNING] Could not find the executable 'mvn' in the path '[]'.
[WARNING] Could not find the executable 'maven' in the path '[]'.
[WARNING] Could not find the executable 'ant' in the path '[]'.
22:19:33,726 WARN  [MetaData.warn](98) No manager for annotations was found in the CLASSPATH so all annotations are ignored.
22:19:34,100 WARN  [MetaData.warn](98) No manager for annotations was found in the CLASSPATH so all annotations are ignored.
[WARNING] Using 'nobody@localhost' as the to address for all emails.
[INFO] Starting task executor, thread name 'build-project'.
[INFO] Starting task executor, thread name 'check-out-project'.
22:19:35,264 WARN  [PlexusLifecycleBeanPostProcessor.getLoggerManager](104) No loggerManager set in context. Falling back to ConsoleLoggerManager
[WARNING] Could not find the executable 'mvn' in the path '[]'.
[WARNING] Could not find the executable 'maven' in the path '[]'.
[WARNING] Could not find the executable 'ant' in the path '[]'.
22:19:35,813 WARN  [MetaData.warn](98) No manager for annotations was found in the CLASSPATH so all annotations are ignored.
22:19:36,168 WARN  [MetaData.warn](98) No manager for annotations was found in the CLASSPATH so all annotations are ignored.
[INFO] create default AntBuildDefinitionTemplate
[INFO] create Default Schedule
[INFO] create default MavenOneBuildDefinitionTemplate
[INFO] create default MavenTwoBuildDefinitionTemplate
[INFO] create default ShellBuildDefinitionTemplate
[INFO] Build executors:
[INFO]   shell
[INFO]   maven-1
[INFO]   ant
[INFO]   maven2
[INFO] Initializing Continuum.
[INFO] Showing all projects: 
[INFO] Starting Continuum.
[INFO] 
[INFO] 
[INFO] < Continuum unknown started! >
[INFO] ------------------------------
[INFO]        \   ^__^
[INFO]         \  (oo)\_______
[INFO]            (__)\       )\/\
[INFO]                ||----w |
[INFO]                ||     ||
[INFO] 
[INFO] 
[INFO] Continuum initializer running ...
[INFO] Default Project Group exists
[INFO] Continuum initializer end running ...
[INFO] Activating schedules ...
[WARNING] Will not schedule this job as a job {DEFAULT_SCHEDULE:DEFAULT} already exists.
[INFO] DEFAULT_SCHEDULE: next fire time ->null
[INFO] Downloading file:/home/continuum/data/working-directory/463/src/test/resources/projects/continuum/continuum-notifiers/pom.xml
[INFO] Downloading file:/home/continuum/data/working-directory/463/src/test/resources/projects/continuum/continuum-notifiers/continuum-notifier-irc/pom.xml
[INFO] Downloading file:/home/continuum/data/working-directory/463/src/test/resources/projects/continuum/continuum-notifiers/continuum-notifier-jabber/pom.xml
[INFO] Created 3 projects.
[INFO] Created 1 project groups.
[INFO] 0 errors.
[INFO] Creating project group with the group id: 'org.apache.maven.continuum'.
[INFO] loading redback-xwork-integration-core
[INFO] loading Continuum
number of projects: 3
number of project groups: 2
22:19:38,907 WARN  [PlexusLifecycleBeanPostProcessor.getLoggerManager](104) No loggerManager set in context. Falling back to ConsoleLoggerManager
[WARNING] Could not find the executable 'mvn' in the path '[]'.
[WARNING] Could not find the executable 'maven' in the path '[]'.
[WARNING] Could not find the executable 'ant' in the path '[]'.
22:19:39,360 WARN  [MetaData.warn](98) No manager for annotations was found in the CLASSPATH so all annotations are ignored.
22:19:39,792 WARN  [MetaData.warn](98) No manager for annotations was found in the CLASSPATH so all annotations are ignored.
[INFO] create default AntBuildDefinitionTemplate
[INFO] create Default Schedule
[INFO] create default MavenOneBuildDefinitionTemplate
[INFO] create default MavenTwoBuildDefinitionTemplate
[INFO] create default ShellBuildDefinitionTemplate
[INFO] Build executors:
[INFO]   shell
[INFO]   maven-1
[INFO]   ant
[INFO]   maven2
[INFO] Initializing Continuum.
[INFO] Showing all projects: 
[INFO] Starting Continuum.
[INFO] 
[INFO] 
[INFO] < Continuum unknown started! >
[INFO] ------------------------------
[INFO]        \   ^__^
[INFO]         \  (oo)\_______
[INFO]            (__)\       )\/\
[INFO]                ||----w |
[INFO]                ||     ||
[INFO] 
[INFO] 
[INFO] Continuum initializer running ...
[INFO] Default Project Group exists
[INFO] Continuum initializer end running ...
[INFO] Activating schedules ...
[WARNING] Will not schedule this job as a job {DEFAULT_SCHEDULE:DEFAULT} already exists.
[INFO] DEFAULT_SCHEDULE: next fire time ->null
[INFO] Downloading file:/home/continuum/data/working-directory/463/src/test-projects/project1/pom.xml
[INFO] Created 1 projects.
[INFO] Created 1 project groups.
[INFO] 0 errors.
[INFO] Creating project group with the group id: 'plexus'.
[INFO] loading redback-xwork-integration-core
[INFO] loading Continuum
22:19:41,170 WARN  [PlexusLifecycleBeanPostProcessor.getLoggerManager](104) No loggerManager set in context. Falling back to ConsoleLoggerManager
[WARNING] Could not find the executable 'mvn' in the path '[]'.
[WARNING] Could not find the executable 'maven' in the path '[]'.
[WARNING] Could not find the executable 'ant' in the path '[]'.
22:19:41,689 WARN  [MetaData.warn](98) No manager for annotations was found in the CLASSPATH so all annotations are ignored.
22:19:42,085 WARN  [MetaData.warn](98) No manager for annotations was found in the CLASSPATH so all annotations are ignored.
[INFO] create default AntBuildDefinitionTemplate
[INFO] create Default Schedule
[INFO] create default MavenOneBuildDefinitionTemplate
[INFO] create default MavenTwoBuildDefinitionTemplate
[INFO] create default ShellBuildDefinitionTemplate
[INFO] Build executors:
[INFO]   shell
[INFO]   maven-1
[INFO]   ant
[INFO]   maven2
[INFO] Initializing Continuum.
[INFO] Showing all projects: 
[INFO] Starting Continuum.
[INFO] 
[INFO] 
[INFO] < Continuum unknown started! >
[INFO] ------------------------------
[INFO]        \   ^__^
[INFO]         \  (oo)\_______
[INFO]            (__)\       )\/\
[INFO]                ||----w |
[INFO]                ||     ||
[INFO] 
[INFO] 
[INFO] Continuum initializer running ...
[INFO] Default Project Group exists
[INFO] Continuum initializer end running ...
[INFO] Activating schedules ...
[WARNING] Will not schedule this job as a job {DEFAULT_SCHEDULE:DEFAULT} already exists.
[INFO] DEFAULT_SCHEDULE: next fire time ->null
[INFO] Downloading file:/home/continuum/data/working-directory/463/src/test-projects/project1/pom.xml
[INFO] Created 1 projects.
[INFO] Created 1 project groups.
[INFO] 0 errors.
[INFO] Creating project group with the group id: 'plexus'.
[INFO] loading redback-xwork-integration-core
[INFO] loading Continuum
22:19:43,564 WARN  [PlexusLifecycleBeanPostProcessor.getLoggerManager](104) No loggerManager set in context. Falling back to ConsoleLoggerManager
[WARNING] Could not find the executable 'mvn' in the path '[]'.
[WARNING] Could not find the executable 'maven' in the path '[]'.
[WARNING] Could not find the executable 'ant' in the path '[]'.
22:19:44,520 WARN  [MetaData.warn](98) No manager for annotations was found in the CLASSPATH so all annotations are ignored.
22:19:44,952 WARN  [MetaData.warn](98) No manager for annotations was found in the CLASSPATH so all annotations are ignored.
[INFO] create default AntBuildDefinitionTemplate
[INFO] create Default Schedule
[INFO] create default MavenOneBuildDefinitionTemplate
[INFO] create default MavenTwoBuildDefinitionTemplate
[INFO] create default ShellBuildDefinitionTemplate
[INFO] Build executors:
[INFO]   shell
[INFO]   maven-1
[INFO]   ant
[INFO]   maven2
[INFO] Initializing Continuum.
[INFO] Showing all projects: 
[INFO] Starting Continuum.
[INFO] 
[INFO] 
[INFO] < Continuum unknown started! >
[INFO] ------------------------------
[INFO]        \   ^__^
[INFO]         \  (oo)\_______
[INFO]            (__)\       )\/\
[INFO]                ||----w |
[INFO]                ||     ||
[INFO] 
[INFO] 
[INFO] Continuum initializer running ...
[INFO] Default Project Group exists
[INFO] Continuum initializer end running ...
[INFO] Activating schedules ...
[WARNING] Will not schedule this job as a job {DEFAULT_SCHEDULE:DEFAULT} already exists.
[INFO] DEFAULT_SCHEDULE: next fire time ->null
[INFO] Downloading file:/home/continuum/data/working-directory/463/src/test-projects/project1/pom.xml
[INFO] Created 1 projects.
[INFO] Created 1 project groups.
[INFO] 0 errors.
[INFO] Creating project group with the group id: 'plexus'.
[INFO] loading redback-xwork-integration-core
[INFO] loading Continuum
[INFO] Remove project Continuum Test Project 1(1)
[WARNING] Using 'nobody@localhost' as the to address for all emails.
[INFO] Starting task executor, thread name 'build-project'.
[INFO] Remove project group Continuum Test Project 1(2)
22:19:46,177 WARN  [PlexusLifecycleBeanPostProcessor.getLoggerManager](104) No loggerManager set in context. Falling back to ConsoleLoggerManager
[WARNING] Could not find the executable 'mvn' in the path '[]'.
[WARNING] Could not find the executable 'maven' in the path '[]'.
[WARNING] Could not find the executable 'ant' in the path '[]'.
22:19:46,760 WARN  [MetaData.warn](98) No manager for annotations was found in the CLASSPATH so all annotations are ignored.
22:19:47,139 WARN  [MetaData.warn](98) No manager for annotations was found in the CLASSPATH so all annotations are ignored.
[INFO] create default AntBuildDefinitionTemplate
[INFO] create Default Schedule
[INFO] create default MavenOneBuildDefinitionTemplate
[INFO] create default MavenTwoBuildDefinitionTemplate
[INFO] create default ShellBuildDefinitionTemplate
[INFO] Build executors:
[INFO]   shell
[INFO]   maven-1
[INFO]   ant
[INFO]   maven2
[INFO] Initializing Continuum.
[INFO] Showing all projects: 
[INFO] Starting Continuum.
[INFO] 
[INFO] 
[INFO] < Continuum unknown started! >
[INFO] ------------------------------
[INFO]        \   ^__^
[INFO]         \  (oo)\_______
[INFO]            (__)\       )\/\
[INFO]                ||----w |
[INFO]                ||     ||
[INFO] 
[INFO] 
[INFO] Continuum initializer running ...
[INFO] Default Project Group exists
[INFO] Continuum initializer end running ...
[INFO] Activating schedules ...
[WARNING] Will not schedule this job as a job {DEFAULT_SCHEDULE:DEFAULT} already exists.
[INFO] DEFAULT_SCHEDULE: next fire time ->null
[INFO] Downloading file:/home/continuum/data/working-directory/463/src/test-projects/project1/pom.xml
[INFO] Created 1 projects.
[INFO] Created 1 project groups.
[INFO] 0 errors.
[INFO] Creating project group with the group id: 'plexus'.
[INFO] loading redback-xwork-integration-core
[INFO] loading Continuum
22:19:48,398 WARN  [PlexusLifecycleBeanPostProcessor.getLoggerManager](104) No loggerManager set in context. Falling back to ConsoleLoggerManager
[WARNING] Could not find the executable 'mvn' in the path '[]'.
[WARNING] Could not find the executable 'maven' in the path '[]'.
[WARNING] Could not find the executable 'ant' in the path '[]'.
22:19:48,913 WARN  [MetaData.warn](98) No manager for annotations was found in the CLASSPATH so all annotations are ignored.
22:19:49,287 WARN  [MetaData.warn](98) No manager for annotations was found in the CLASSPATH so all annotations are ignored.
[INFO] create default AntBuildDefinitionTemplate
[INFO] create Default Schedule
[INFO] create default MavenOneBuildDefinitionTemplate
[INFO] create default MavenTwoBuildDefinitionTemplate
[INFO] create default ShellBuildDefinitionTemplate
[INFO] Build executors:
[INFO]   shell
[INFO]   maven-1
[INFO]   ant
[INFO]   maven2
[INFO] Initializing Continuum.
[INFO] Showing all projects: 
[INFO] Starting Continuum.
[INFO] 
[INFO] 
[INFO] < Continuum unknown started! >
[INFO] ------------------------------
[INFO]        \   ^__^
[INFO]         \  (oo)\_______
[INFO]            (__)\       )\/\
[INFO]                ||----w |
[INFO]                ||     ||
[INFO] 
[INFO] 
[INFO] Continuum initializer running ...
[INFO] Default Project Group exists
[INFO] Continuum initializer end running ...
[INFO] Activating schedules ...
[WARNING] Will not schedule this job as a job {DEFAULT_SCHEDULE:DEFAULT} already exists.
[INFO] DEFAULT_SCHEDULE: next fire time ->null
22:19:50,271 WARN  [PlexusLifecycleBeanPostProcessor.getLoggerManager](104) No loggerManager set in context. Falling back to ConsoleLoggerManager
[WARNING] Could not find the executable 'mvn' in the path '[]'.
[WARNING] Could not find the executable 'maven' in the path '[]'.
[WARNING] Could not find the executable 'ant' in the path '[]'.
22:19:50,846 WARN  [MetaData.warn](98) No manager for annotations was found in the CLASSPATH so all annotations are ignored.
22:19:51,199 WARN  [MetaData.warn](98) No manager for annotations was found in the CLASSPATH so all annotations are ignored.
[INFO] create default AntBuildDefinitionTemplate
[INFO] create Default Schedule
[INFO] create default MavenOneBuildDefinitionTemplate
[INFO] create default MavenTwoBuildDefinitionTemplate
[INFO] create default ShellBuildDefinitionTemplate
[INFO] Build executors:
[INFO]   shell
[INFO]   maven-1
[INFO]   ant
[INFO]   maven2
[INFO] Initializing Continuum.
[INFO] Showing all projects: 
[INFO] Starting Continuum.
[INFO] 
[INFO] 
[INFO] < Continuum unknown started! >
[INFO] ------------------------------
[INFO]        \   ^__^
[INFO]         \  (oo)\_______
[INFO]            (__)\       )\/\
[INFO]                ||----w |
[INFO]                ||     ||
[INFO] 
[INFO] 
[INFO] Continuum initializer running ...
[INFO] Default Project Group exists
[INFO] Continuum initializer end running ...
[INFO] Activating schedules ...
[WARNING] Will not schedule this job as a job {DEFAULT_SCHEDULE:DEFAULT} already exists.
[INFO] DEFAULT_SCHEDULE: next fire time ->null
[INFO] Downloading file:/home/continuum/data/working-directory/463/src/test-projects/project1/pom.xml
[INFO] Created 1 projects.
[INFO] Created 1 project groups.
[INFO] 0 errors.
[INFO] Creating project group with the group id: 'plexus'.
[INFO] loading redback-xwork-integration-core
[INFO] loading Continuum
22:19:53,011 WARN  [PlexusLifecycleBeanPostProcessor.getLoggerManager](104) No loggerManager set in context. Falling back to ConsoleLoggerManager
[WARNING] Could not find the executable 'mvn' in the path '[]'.
[WARNING] Could not find the executable 'maven' in the path '[]'.
[WARNING] Could not find the executable 'ant' in the path '[]'.
22:19:53,528 WARN  [MetaData.warn](98) No manager for annotations was found in the CLASSPATH so all annotations are ignored.
22:19:53,948 WARN  [MetaData.warn](98) No manager for annotations was found in the CLASSPATH so all annotations are ignored.
[INFO] create default AntBuildDefinitionTemplate
[INFO] create Default Schedule
[INFO] create default MavenOneBuildDefinitionTemplate
[INFO] create default MavenTwoBuildDefinitionTemplate
[INFO] create default ShellBuildDefinitionTemplate
[INFO] Build executors:
[INFO]   shell
[INFO]   maven-1
[INFO]   ant
[INFO]   maven2
[INFO] Initializing Continuum.
[INFO] Showing all projects: 
[INFO] Starting Continuum.
[INFO] 
[INFO] 
[INFO] < Continuum unknown started! >
[INFO] ------------------------------
[INFO]        \   ^__^
[INFO]         \  (oo)\_______
[INFO]            (__)\       )\/\
[INFO]                ||----w |
[INFO]                ||     ||
[INFO] 
[INFO] 
[INFO] Continuum initializer running ...
[INFO] Default Project Group exists
[INFO] Continuum initializer end running ...
[INFO] Activating schedules ...
[WARNING] Will not schedule this job as a job {DEFAULT_SCHEDULE:DEFAULT} already exists.
[INFO] DEFAULT_SCHEDULE: next fire time ->null
[INFO] loading redback-xwork-integration-core
[INFO] loading Continuum
Tests run: 10, Failures: 0, Errors: 0, Skipped: 0, Time elapsed: 25.039 sec
Running org.apache.maven.continuum.buildcontroller.DefaultBuildControllerTest
22:19:55,160 WARN  [PlexusLifecycleBeanPostProcessor.getLoggerManager](104) No loggerManager set in context. Falling back to ConsoleLoggerManager
[WARNING] Could not find the executable 'mvn' in the path '[]'.
[WARNING] Could not find the executable 'maven' in the path '[]'.
[WARNING] Could not find the executable 'ant' in the path '[]'.
22:19:55,744 WARN  [MetaData.warn](98) No manager for annotations was found in the CLASSPATH so all annotations are ignored.
22:19:56,149 WARN  [MetaData.warn](98) No manager for annotations was found in the CLASSPATH so all annotations are ignored.
[WARNING] Using 'nobody@localhost' as the to address for all emails.
[INFO] The project was not built because no changes were detected in sources since the last build.
[INFO] No changes, not building
22:19:57,213 WARN  [PlexusLifecycleBeanPostProcessor.getLoggerManager](104) No loggerManager set in context. Falling back to ConsoleLoggerManager
[WARNING] Could not find the executable 'mvn' in the path '[]'.
[WARNING] Could not find the executable 'maven' in the path '[]'.
[WARNING] Could not find the executable 'ant' in the path '[]'.
22:19:57,800 WARN  [MetaData.warn](98) No manager for annotations was found in the CLASSPATH so all annotations are ignored.
22:19:58,139 WARN  [MetaData.warn](98) No manager for annotations was found in the CLASSPATH so all annotations are ignored.
[WARNING] Using 'nobody@localhost' as the to address for all emails.
[INFO] The project was never be built with the current build definition, building
22:19:59,168 WARN  [PlexusLifecycleBeanPostProcessor.getLoggerManager](104) No loggerManager set in context. Falling back to ConsoleLoggerManager
[WARNING] Could not find the executable 'mvn' in the path '[]'.
[WARNING] Could not find the executable 'maven' in the path '[]'.
[WARNING] Could not find the executable 'ant' in the path '[]'.
22:19:59,794 WARN  [MetaData.warn](98) No manager for annotations was found in the CLASSPATH so all annotations are ignored.
22:20:00,221 WARN  [MetaData.warn](98) No manager for annotations was found in the CLASSPATH so all annotations are ignored.
[WARNING] Using 'nobody@localhost' as the to address for all emails.
[INFO] The project was never be built with the current build definition, building
22:20:01,783 WARN  [PlexusLifecycleBeanPostProcessor.getLoggerManager](104) No loggerManager set in context. Falling back to ConsoleLoggerManager
[WARNING] Could not find the executable 'mvn' in the path '[]'.
[WARNING] Could not find the executable 'maven' in the path '[]'.
[WARNING] Could not find the executable 'ant' in the path '[]'.
22:20:02,415 WARN  [MetaData.warn](98) No manager for annotations was found in the CLASSPATH so all annotations are ignored.
22:20:02,836 WARN  [MetaData.warn](98) No manager for annotations was found in the CLASSPATH so all annotations are ignored.
[WARNING] Using 'nobody@localhost' as the to address for all emails.
[INFO] The project was not built because no changes were detected in sources since the last build.
[INFO] Found dependencies changes, building
[INFO] Changes found, building
Tests run: 4, Failures: 0, Errors: 0, Skipped: 0, Time elapsed: 8.665 sec
Running org.apache.maven.continuum.profile.DefaultProfileServiceTest
22:20:03,899 WARN  [PlexusLifecycleBeanPostProcessor.getLoggerManager](104) No loggerManager set in context. Falling back to ConsoleLoggerManager
[WARNING] Could not find the executable 'mvn' in the path '[]'.
[WARNING] Could not find the executable 'maven' in the path '[]'.
[WARNING] Could not find the executable 'ant' in the path '[]'.
22:20:04,444 WARN  [MetaData.warn](98) No manager for annotations was found in the CLASSPATH so all annotations are ignored.
22:20:04,926 WARN  [MetaData.warn](98) No manager for annotations was found in the CLASSPATH so all annotations are ignored.
22:20:05,904 WARN  [PlexusLifecycleBeanPostProcessor.getLoggerManager](104) No loggerManager set in context. Falling back to ConsoleLoggerManager
[WARNING] Could not find the executable 'mvn' in the path '[]'.
[WARNING] Could not find the executable 'maven' in the path '[]'.
[WARNING] Could not find the executable 'ant' in the path '[]'.
22:20:06,436 WARN  [MetaData.warn](98) No manager for annotations was found in the CLASSPATH so all annotations are ignored.
22:20:06,915 WARN  [MetaData.warn](98) No manager for annotations was found in the CLASSPATH so all annotations are ignored.
22:20:07,819 WARN  [PlexusLifecycleBeanPostProcessor.getLoggerManager](104) No loggerManager set in context. Falling back to ConsoleLoggerManager
[WARNING] Could not find the executable 'mvn' in the path '[]'.
[WARNING] Could not find the executable 'maven' in the path '[]'.
[WARNING] Could not find the executable 'ant' in the path '[]'.
22:20:08,453 WARN  [MetaData.warn](98) No manager for annotations was found in the CLASSPATH so all annotations are ignored.
22:20:08,874 WARN  [MetaData.warn](98) No manager for annotations was found in the CLASSPATH so all annotations are ignored.
22:20:10,274 WARN  [PlexusLifecycleBeanPostProcessor.getLoggerManager](104) No loggerManager set in context. Falling back to ConsoleLoggerManager
[WARNING] Could not find the executable 'mvn' in the path '[]'.
[WARNING] Could not find the executable 'maven' in the path '[]'.
[WARNING] Could not find the executable 'ant' in the path '[]'.
22:20:10,916 WARN  [MetaData.warn](98) No manager for annotations was found in the CLASSPATH so all annotations are ignored.
22:20:11,288 WARN  [MetaData.warn](98) No manager for annotations was found in the CLASSPATH so all annotations are ignored.
22:20:12,255 WARN  [PlexusLifecycleBeanPostProcessor.getLoggerManager](104) No loggerManager set in context. Falling back to ConsoleLoggerManager
[WARNING] Could not find the executable 'mvn' in the path '[]'.
[WARNING] Could not find the executable 'maven' in the path '[]'.
[WARNING] Could not find the executable 'ant' in the path '[]'.
22:20:12,961 WARN  [MetaData.warn](98) No manager for annotations was found in the CLASSPATH so all annotations are ignored.
22:20:13,389 WARN  [MetaData.warn](98) No manager for annotations was found in the CLASSPATH so all annotations are ignored.
22:20:14,372 WARN  [PlexusLifecycleBeanPostProcessor.getLoggerManager](104) No loggerManager set in context. Falling back to ConsoleLoggerManager
[WARNING] Could not find the executable 'mvn' in the path '[]'.
[WARNING] Could not find the executable 'maven' in the path '[]'.
[WARNING] Could not find the executable 'ant' in the path '[]'.
22:20:15,384 WARN  [MetaData.warn](98) No manager for annotations was found in the CLASSPATH so all annotations are ignored.
22:20:15,841 WARN  [MetaData.warn](98) No manager for annotations was found in the CLASSPATH so all annotations are ignored.
22:20:16,753 WARN  [PlexusLifecycleBeanPostProcessor.getLoggerManager](104) No loggerManager set in context. Falling back to ConsoleLoggerManager
[WARNING] Could not find the executable 'mvn' in the path '[]'.
[WARNING] Could not find the executable 'maven' in the path '[]'.
[WARNING] Could not find the executable 'ant' in the path '[]'.
22:20:17,767 WARN  [MetaData.warn](98) No manager for annotations was found in the CLASSPATH so all annotations are ignored.
22:20:18,100 WARN  [MetaData.warn](98) No manager for annotations was found in the CLASSPATH so all annotations are ignored.
22:20:19,085 WARN  [PlexusLifecycleBeanPostProcessor.getLoggerManager](104) No loggerManager set in context. Falling back to ConsoleLoggerManager
[WARNING] Could not find the executable 'mvn' in the path '[]'.
[WARNING] Could not find the executable 'maven' in the path '[]'.
[WARNING] Could not find the executable 'ant' in the path '[]'.
22:20:19,762 WARN  [MetaData.warn](98) No manager for annotations was found in the CLASSPATH so all annotations are ignored.
22:20:20,153 WARN  [MetaData.warn](98) No manager for annotations was found in the CLASSPATH so all annotations are ignored.
Tests run: 8, Failures: 0, Errors: 0, Skipped: 0, Time elapsed: 17.311 sec
Running org.apache.maven.continuum.notification.ContinuumNotificationDispatcherTest
22:20:21,632 WARN  [PlexusLifecycleBeanPostProcessor.getLoggerManager](104) No loggerManager set in context. Falling back to ConsoleLoggerManager
[WARNING] Could not find the executable 'mvn' in the path '[]'.
[WARNING] Could not find the executable 'maven' in the path '[]'.
[WARNING] Could not find the executable 'ant' in the path '[]'.
22:20:22,362 WARN  [MetaData.warn](98) No manager for annotations was found in the CLASSPATH so all annotations are ignored.
22:20:22,816 WARN  [MetaData.warn](98) No manager for annotations was found in the CLASSPATH so all annotations are ignored.
[INFO] create default AntBuildDefinitionTemplate
[INFO] create Default Schedule
[INFO] create default MavenOneBuildDefinitionTemplate
[INFO] create default MavenTwoBuildDefinitionTemplate
[INFO] create default ShellBuildDefinitionTemplate
[INFO] Build executors:
[INFO]   shell
[INFO]   maven-1
[INFO]   ant
[INFO]   maven2
[INFO] Initializing Continuum.
[INFO] Showing all projects: 
[INFO] Starting Continuum.
[INFO] 
[INFO] 
[INFO] < Continuum unknown started! >
[INFO] ------------------------------
[INFO]        \   ^__^
[INFO]         \  (oo)\_______
[INFO]            (__)\       )\/\
[INFO]                ||----w |
[INFO]                ||     ||
[INFO] 
[INFO] 
[INFO] Continuum initializer running ...
[INFO] Default Project Group exists
[INFO] Continuum initializer end running ...
[INFO] Activating schedules ...
[WARNING] Will not schedule this job as a job {DEFAULT_SCHEDULE:DEFAULT} already exists.
[INFO] DEFAULT_SCHEDULE: next fire time ->null
[INFO] Using 'continuum@localhost' as the from mailbox for all emails.
[INFO] From name: Continuum
[INFO] Build host name: vmbuild.apache.org
[WARNING] Using 'nobody@localhost' as the to address for all emails.
[ERROR] Error while trying to use the mail notifier.
org.codehaus.plexus.notification.NotificationException: Error while generating mail contents.
	at org.apache.maven.continuum.notification.mail.MailContinuumNotifier.buildComplete(MailContinuumNotifier.java:370)
	at org.apache.maven.continuum.notification.mail.MailContinuumNotifier.sendNotification(MailContinuumNotifier.java:254)
	at org.apache.maven.continuum.notification.DefaultContinuumNotificationDispatcher.sendNotification(DefaultContinuumNotificationDispatcher.java:199)
	at org.apache.maven.continuum.notification.DefaultContinuumNotificationDispatcher.sendNotification(DefaultContinuumNotificationDispatcher.java:151)
	at org.apache.maven.continuum.notification.DefaultContinuumNotificationDispatcher.buildComplete(DefaultContinuumNotificationDispatcher.java:103)
	at org.apache.maven.continuum.notification.ContinuumNotificationDispatcherTest.testNotificationDispatcher(ContinuumNotificationDispatcherTest.java:59)
	at sun.reflect.NativeMethodAccessorImpl.invoke0(Native Method)
	at sun.reflect.NativeMethodAccessorImpl.invoke(NativeMethodAccessorImpl.java:39)
	at sun.reflect.DelegatingMethodAccessorImpl.invoke(DelegatingMethodAccessorImpl.java:25)
	at java.lang.reflect.Method.invoke(Method.java:597)
	at junit.framework.TestCase.runTest(TestCase.java:154)
	at junit.framework.TestCase.runBare(TestCase.java:127)
	at junit.framework.TestResult$1.protect(TestResult.java:106)
	at junit.framework.TestResult.runProtected(TestResult.java:124)
	at junit.framework.TestResult.run(TestResult.java:109)
	at junit.framework.TestCase.run(TestCase.java:118)
	at junit.framework.TestSuite.runTest(TestSuite.java:208)
	at junit.framework.TestSuite.run(TestSuite.java:203)
	at sun.reflect.NativeMethodAccessorImpl.invoke0(Native Method)
	at sun.reflect.NativeMethodAccessorImpl.invoke(NativeMethodAccessorImpl.java:39)
	at sun.reflect.DelegatingMethodAccessorImpl.invoke(DelegatingMethodAccessorImpl.java:25)
	at java.lang.reflect.Method.invoke(Method.java:597)
	at org.apache.maven.surefire.junit.JUnitTestSet.execute(JUnitTestSet.java:213)
	at org.apache.maven.surefire.suite.AbstractDirectoryTestSuite.executeTestSet(AbstractDirectoryTestSuite.java:140)
	at org.apache.maven.surefire.suite.AbstractDirectoryTestSuite.execute(AbstractDirectoryTestSuite.java:127)
	at org.apache.maven.surefire.Surefire.run(Surefire.java:177)
	at sun.reflect.NativeMethodAccessorImpl.invoke0(Native Method)
	at sun.reflect.NativeMethodAccessorImpl.invoke(NativeMethodAccessorImpl.java:39)
	at sun.reflect.DelegatingMethodAccessorImpl.invoke(DelegatingMethodAccessorImpl.java:25)
	at java.lang.reflect.Method.invoke(Method.java:597)
	at org.apache.maven.surefire.booter.SurefireBooter.runSuitesInProcess(SurefireBooter.java:338)
	at org.apache.maven.surefire.booter.SurefireBooter.main(SurefireBooter.java:997)
Caused by: java.lang.NullPointerException
	at org.apache.maven.continuum.notification.mail.MailContinuumNotifier.buildComplete(MailContinuumNotifier.java:304)
	... 31 more
Tests run: 1, Failures: 0, Errors: 0, Skipped: 0, Time elapsed: 2.737 sec
Running org.apache.maven.continuum.execution.maven.m1.MavenOneBuildExecutorTest
22:20:23,999 WARN  [PlexusLifecycleBeanPostProcessor.getLoggerManager](104) No loggerManager set in context. Falling back to ConsoleLoggerManager
[WARNING] Could not find the executable 'mvn' in the path '[]'.
[WARNING] Could not find the executable 'maven' in the path '[]'.
[WARNING] Could not find the executable 'ant' in the path '[]'.
22:20:24,641 WARN  [MetaData.warn](98) No manager for annotations was found in the CLASSPATH so all annotations are ignored.
22:20:25,058 WARN  [MetaData.warn](98) No manager for annotations was found in the CLASSPATH so all annotations are ignored.
[INFO] Build executors:
[INFO]   shell
[INFO]   maven-1
[INFO]   ant
[INFO]   maven2
22:20:25,972 WARN  [PlexusLifecycleBeanPostProcessor.getLoggerManager](104) No loggerManager set in context. Falling back to ConsoleLoggerManager
[WARNING] Could not find the executable 'mvn' in the path '[]'.
[WARNING] Could not find the executable 'maven' in the path '[]'.
[WARNING] Could not find the executable 'ant' in the path '[]'.
22:20:26,618 WARN  [MetaData.warn](98) No manager for annotations was found in the CLASSPATH so all annotations are ignored.
22:20:27,027 WARN  [MetaData.warn](98) No manager for annotations was found in the CLASSPATH so all annotations are ignored.
[INFO] Build executors:
[INFO]   shell
[INFO]   maven-1
[INFO]   ant
[INFO]   maven2
22:20:27,971 WARN  [PlexusLifecycleBeanPostProcessor.getLoggerManager](104) No loggerManager set in context. Falling back to ConsoleLoggerManager
[WARNING] Could not find the executable 'mvn' in the path '[]'.
[WARNING] Could not find the executable 'maven' in the path '[]'.
[WARNING] Could not find the executable 'ant' in the path '[]'.
22:20:28,649 WARN  [MetaData.warn](98) No manager for annotations was found in the CLASSPATH so all annotations are ignored.
22:20:29,056 WARN  [MetaData.warn](98) No manager for annotations was found in the CLASSPATH so all annotations are ignored.
[INFO] Build executors:
[INFO]   shell
[INFO]   maven-1
[INFO]   ant
[INFO]   maven2
22:20:29,964 WARN  [PlexusLifecycleBeanPostProcessor.getLoggerManager](104) No loggerManager set in context. Falling back to ConsoleLoggerManager
[WARNING] Could not find the executable 'mvn' in the path '[]'.
[WARNING] Could not find the executable 'maven' in the path '[]'.
[WARNING] Could not find the executable 'ant' in the path '[]'.
22:20:30,637 WARN  [MetaData.warn](98) No manager for annotations was found in the CLASSPATH so all annotations are ignored.
22:20:31,571 WARN  [MetaData.warn](98) No manager for annotations was found in the CLASSPATH so all annotations are ignored.
[INFO] Build executors:
[INFO]   shell
[INFO]   maven-1
[INFO]   ant
[INFO]   maven2
Tests run: 4, Failures: 0, Errors: 0, Skipped: 0, Time elapsed: 9.125 sec
Running org.apache.maven.continuum.initialization.DefaultContinuumInitializerTest
22:20:32,982 WARN  [PlexusLifecycleBeanPostProcessor.getLoggerManager](104) No loggerManager set in context. Falling back to ConsoleLoggerManager
[WARNING] Could not find the executable 'mvn' in the path '[]'.
[WARNING] Could not find the executable 'maven' in the path '[]'.
[WARNING] Could not find the executable 'ant' in the path '[]'.
22:20:33,719 WARN  [MetaData.warn](98) No manager for annotations was found in the CLASSPATH so all annotations are ignored.
22:20:34,134 WARN  [MetaData.warn](98) No manager for annotations was found in the CLASSPATH so all annotations are ignored.
[INFO] create default AntBuildDefinitionTemplate
[INFO] create Default Schedule
[INFO] create default MavenOneBuildDefinitionTemplate
[INFO] create default MavenTwoBuildDefinitionTemplate
[INFO] create default ShellBuildDefinitionTemplate
[INFO] Continuum initializer running ...
[INFO] create Default Project Group
[INFO] Continuum initializer end running ...
Tests run: 1, Failures: 0, Errors: 0, Skipped: 0, Time elapsed: 2.083 sec
Running org.apache.maven.continuum.project.builder.maven.MavenOneContinuumProjectBuilderTest
22:20:35,089 WARN  [PlexusLifecycleBeanPostProcessor.getLoggerManager](104) No loggerManager set in context. Falling back to ConsoleLoggerManager
[WARNING] Could not find the executable 'mvn' in the path '[]'.
[WARNING] Could not find the executable 'maven' in the path '[]'.
[WARNING] Could not find the executable 'ant' in the path '[]'.
22:20:35,832 WARN  [MetaData.warn](98) No manager for annotations was found in the CLASSPATH so all annotations are ignored.
22:20:36,163 WARN  [MetaData.warn](98) No manager for annotations was found in the CLASSPATH so all annotations are ignored.
[INFO] create default AntBuildDefinitionTemplate
[INFO] create Default Schedule
[INFO] create default MavenOneBuildDefinitionTemplate
[INFO] create default MavenTwoBuildDefinitionTemplate
[INFO] create default ShellBuildDefinitionTemplate
[INFO] Downloading file:/home/continuum/data/working-directory/463/src/test/resources/projects/maven-1.pom.xml
22:20:37,125 WARN  [PlexusLifecycleBeanPostProcessor.getLoggerManager](104) No loggerManager set in context. Falling back to ConsoleLoggerManager
[WARNING] Could not find the executable 'mvn' in the path '[]'.
[WARNING] Could not find the executable 'maven' in the path '[]'.
[WARNING] Could not find the executable 'ant' in the path '[]'.
22:20:37,900 WARN  [MetaData.warn](98) No manager for annotations was found in the CLASSPATH so all annotations are ignored.
22:20:38,230 WARN  [MetaData.warn](98) No manager for annotations was found in the CLASSPATH so all annotations are ignored.
[INFO] create default AntBuildDefinitionTemplate
[INFO] create Default Schedule
[INFO] create default MavenOneBuildDefinitionTemplate
[INFO] create default MavenTwoBuildDefinitionTemplate
[INFO] create default ShellBuildDefinitionTemplate
[INFO] Downloading file:/home/continuum/data/working-directory/463/src/test/resources/projects/maven-1.pom.xml
Tests run: 2, Failures: 0, Errors: 0, Skipped: 0, Time elapsed: 4.142 sec
Running org.apache.maven.continuum.installation.DefaultInstallationServiceTest
22:20:39,169 WARN  [PlexusLifecycleBeanPostProcessor.getLoggerManager](104) No loggerManager set in context. Falling back to ConsoleLoggerManager
[WARNING] Could not find the executable 'mvn' in the path '[]'.
[WARNING] Could not find the executable 'maven' in the path '[]'.
[WARNING] Could not find the executable 'ant' in the path '[]'.
22:20:39,885 WARN  [MetaData.warn](98) No manager for annotations was found in the CLASSPATH so all annotations are ignored.
22:20:40,296 WARN  [MetaData.warn](98) No manager for annotations was found in the CLASSPATH so all annotations are ignored.
22:20:41,197 WARN  [PlexusLifecycleBeanPostProcessor.getLoggerManager](104) No loggerManager set in context. Falling back to ConsoleLoggerManager
[WARNING] Could not find the executable 'mvn' in the path '[]'.
[WARNING] Could not find the executable 'maven' in the path '[]'.
[WARNING] Could not find the executable 'ant' in the path '[]'.
22:20:41,942 WARN  [MetaData.warn](98) No manager for annotations was found in the CLASSPATH so all annotations are ignored.
22:20:42,332 WARN  [MetaData.warn](98) No manager for annotations was found in the CLASSPATH so all annotations are ignored.
22:20:43,234 WARN  [PlexusLifecycleBeanPostProcessor.getLoggerManager](104) No loggerManager set in context. Falling back to ConsoleLoggerManager
[WARNING] Could not find the executable 'mvn' in the path '[]'.
[WARNING] Could not find the executable 'maven' in the path '[]'.
[WARNING] Could not find the executable 'ant' in the path '[]'.
22:20:44,063 WARN  [MetaData.warn](98) No manager for annotations was found in the CLASSPATH so all annotations are ignored.
22:20:44,404 WARN  [MetaData.warn](98) No manager for annotations was found in the CLASSPATH so all annotations are ignored.
22:20:45,979 WARN  [PlexusLifecycleBeanPostProcessor.getLoggerManager](104) No loggerManager set in context. Falling back to ConsoleLoggerManager
[WARNING] Could not find the executable 'mvn' in the path '[]'.
[WARNING] Could not find the executable 'maven' in the path '[]'.
[WARNING] Could not find the executable 'ant' in the path '[]'.
22:20:47,155 WARN  [MetaData.warn](98) No manager for annotations was found in the CLASSPATH so all annotations are ignored.
22:20:47,556 WARN  [MetaData.warn](98) No manager for annotations was found in the CLASSPATH so all annotations are ignored.
22:20:49,398 WARN  [PlexusLifecycleBeanPostProcessor.getLoggerManager](104) No loggerManager set in context. Falling back to ConsoleLoggerManager
[WARNING] Could not find the executable 'mvn' in the path '[]'.
[WARNING] Could not find the executable 'maven' in the path '[]'.
[WARNING] Could not find the executable 'ant' in the path '[]'.
22:20:50,553 WARN  [MetaData.warn](98) No manager for annotations was found in the CLASSPATH so all annotations are ignored.
22:20:50,942 WARN  [MetaData.warn](98) No manager for annotations was found in the CLASSPATH so all annotations are ignored.
22:20:52,484 WARN  [PlexusLifecycleBeanPostProcessor.getLoggerManager](104) No loggerManager set in context. Falling back to ConsoleLoggerManager
[WARNING] Could not find the executable 'mvn' in the path '[]'.
[WARNING] Could not find the executable 'maven' in the path '[]'.
[WARNING] Could not find the executable 'ant' in the path '[]'.
22:20:53,670 WARN  [MetaData.warn](98) No manager for annotations was found in the CLASSPATH so all annotations are ignored.
22:20:54,070 WARN  [MetaData.warn](98) No manager for annotations was found in the CLASSPATH so all annotations are ignored.
[java version "1.6.0_05", Java(TM) SE Runtime Environment (build 1.6.0_05-b13), Java HotSpot(TM) Client VM (build 10.0-b19, mixed mode, sharing)]
22:20:55,667 WARN  [PlexusLifecycleBeanPostProcessor.getLoggerManager](104) No loggerManager set in context. Falling back to ConsoleLoggerManager
[WARNING] Could not find the executable 'mvn' in the path '[]'.
[WARNING] Could not find the executable 'maven' in the path '[]'.
[WARNING] Could not find the executable 'ant' in the path '[]'.
22:20:56,955 WARN  [MetaData.warn](98) No manager for annotations was found in the CLASSPATH so all annotations are ignored.
22:20:57,347 WARN  [MetaData.warn](98) No manager for annotations was found in the CLASSPATH so all annotations are ignored.
22:20:59,167 WARN  [PlexusLifecycleBeanPostProcessor.getLoggerManager](104) No loggerManager set in context. Falling back to ConsoleLoggerManager
[WARNING] Could not find the executable 'mvn' in the path '[]'.
[WARNING] Could not find the executable 'maven' in the path '[]'.
[WARNING] Could not find the executable 'ant' in the path '[]'.
22:21:00,360 WARN  [MetaData.warn](98) No manager for annotations was found in the CLASSPATH so all annotations are ignored.
22:21:00,743 WARN  [MetaData.warn](98) No manager for annotations was found in the CLASSPATH so all annotations are ignored.
22:21:01,643 WARN  [PlexusLifecycleBeanPostProcessor.getLoggerManager](104) No loggerManager set in context. Falling back to ConsoleLoggerManager
[WARNING] Could not find the executable 'mvn' in the path '[]'.
[WARNING] Could not find the executable 'maven' in the path '[]'.
[WARNING] Could not find the executable 'ant' in the path '[]'.
22:21:02,930 WARN  [MetaData.warn](98) No manager for annotations was found in the CLASSPATH so all annotations are ignored.
22:21:03,248 WARN  [MetaData.warn](98) No manager for annotations was found in the CLASSPATH so all annotations are ignored.
Tests run: 9, Failures: 0, Errors: 0, Skipped: 0, Time elapsed: 24.976 sec
Running org.apache.maven.continuum.notification.mail.FormatterToolTest
Tests run: 1, Failures: 0, Errors: 0, Skipped: 0, Time elapsed: 0.004 sec
Running org.apache.maven.continuum.core.action.CreateProjectsFromMetadataTest
[INFO] checking for settings auth setup
[INFO] checking for settings auth setup
Tests run: 2, Failures: 0, Errors: 0, Skipped: 0, Time elapsed: 0.154 sec
Running org.apache.maven.continuum.execution.manager.DefaultBuildExecutorManagerTest
22:21:05,095 WARN  [PlexusLifecycleBeanPostProcessor.getLoggerManager](104) No loggerManager set in context. Falling back to ConsoleLoggerManager
[WARNING] Could not find the executable 'mvn' in the path '[]'.
[WARNING] Could not find the executable 'maven' in the path '[]'.
[WARNING] Could not find the executable 'ant' in the path '[]'.
22:21:06,414 WARN  [MetaData.warn](98) No manager for annotations was found in the CLASSPATH so all annotations are ignored.
22:21:06,844 WARN  [MetaData.warn](98) No manager for annotations was found in the CLASSPATH so all annotations are ignored.
[INFO] Build executors:
[INFO]   shell
[INFO]   maven-1
[INFO]   ant
[INFO]   maven2
22:21:07,717 WARN  [PlexusLifecycleBeanPostProcessor.getLoggerManager](104) No loggerManager set in context. Falling back to ConsoleLoggerManager
[WARNING] Could not find the executable 'mvn' in the path '[]'.
[WARNING] Could not find the executable 'maven' in the path '[]'.
[WARNING] Could not find the executable 'ant' in the path '[]'.
22:21:08,949 WARN  [MetaData.warn](98) No manager for annotations was found in the CLASSPATH so all annotations are ignored.
22:21:09,351 WARN  [MetaData.warn](98) No manager for annotations was found in the CLASSPATH so all annotations are ignored.
[INFO] Build executors:
[INFO]   shell
[INFO]   maven-1
[INFO]   ant
[INFO]   maven2
22:21:10,217 WARN  [PlexusLifecycleBeanPostProcessor.getLoggerManager](104) No loggerManager set in context. Falling back to ConsoleLoggerManager
[WARNING] Could not find the executable 'mvn' in the path '[]'.
[WARNING] Could not find the executable 'maven' in the path '[]'.
[WARNING] Could not find the executable 'ant' in the path '[]'.
22:21:11,504 WARN  [MetaData.warn](98) No manager for annotations was found in the CLASSPATH so all annotations are ignored.
22:21:11,923 WARN  [MetaData.warn](98) No manager for annotations was found in the CLASSPATH so all annotations are ignored.
[INFO] Build executors:
[INFO]   shell
[INFO]   maven-1
[INFO]   ant
[INFO]   maven2
22:21:12,751 WARN  [PlexusLifecycleBeanPostProcessor.getLoggerManager](104) No loggerManager set in context. Falling back to ConsoleLoggerManager
[WARNING] Could not find the executable 'mvn' in the path '[]'.
[WARNING] Could not find the executable 'maven' in the path '[]'.
[WARNING] Could not find the executable 'ant' in the path '[]'.
22:21:14,027 WARN  [MetaData.warn](98) No manager for annotations was found in the CLASSPATH so all annotations are ignored.
22:21:14,362 WARN  [MetaData.warn](98) No manager for annotations was found in the CLASSPATH so all annotations are ignored.
[INFO] Build executors:
[INFO]   shell
[INFO]   maven-1
[INFO]   ant
[INFO]   maven2
Tests run: 4, Failures: 0, Errors: 0, Skipped: 0, Time elapsed: 10.936 sec

Results :

Tests run: 64, Failures: 0, Errors: 0, Skipped: 0

[INFO] Stopping Continuum.
[INFO] Continuum stopped.
[INFO] Stopping Continuum.
[INFO] Continuum stopped.
[INFO] Stopping Continuum.
[INFO] Continuum stopped.
[INFO] Stopping Continuum.
[INFO] Continuum stopped.
[INFO] Stopping Continuum.
[INFO] Continuum stopped.
[INFO] Stopping Continuum.
[INFO] Continuum stopped.
[INFO] Stopping Continuum.
[INFO] Continuum stopped.
[INFO] Stopping Continuum.
[INFO] Continuum stopped.
[INFO] Stopping Continuum.
[INFO] Continuum stopped.
[INFO] Stopping Continuum.
[INFO] Continuum stopped.
[INFO] Stopping Continuum.
[INFO] Continuum stopped.
[INFO] Stopping Continuum.
[INFO] Continuum stopped.
[INFO] Stopping Continuum.
[INFO] Continuum stopped.
[INFO] [jar:jar]
[INFO] Building jar: /home/continuum/data/working-directory/463/target/continuum-core-1.2-SNAPSHOT.jar
[INFO] [install:install]
[INFO] Installing /home/continuum/data/working-directory/463/target/continuum-core-1.2-SNAPSHOT.jar to /home/continuum/.m2/repository/org/apache/continuum/continuum-core/1.2-SNAPSHOT/continuum-core-1.2-SNAPSHOT.jar
[INFO] ------------------------------------------------------------------------
[INFO] BUILD SUCCESSFUL
[INFO] ------------------------------------------------------------------------
[INFO] Total time: 3 minutes 7 seconds
[INFO] Finished at: Wed May 07 22:21:16 PDT 2008
[INFO] Final Memory: 38M/63M
[INFO] ------------------------------------------------------------------------

****************************************************************************



Mime
View raw message