continuum-notifications mailing list archives

Site index · List index
Message view « Date » · « Thread »
Top « Date » · « Thread »
From Continuum VMBuild Server <contin...@apache.org>
Subject [continuum] BUILD FAILURE: Continuum Core
Date Wed, 07 May 2008 06:35:06 GMT
Online report : http://vmbuild.apache.org/continuum/buildResult.action?buildId=87412&projectId=463

Build statistics:
  State: Failed
  Previous State: Failed
  Started at: Tue 6 May 2008 23:34:39 -0700
  Finished at: Tue 6 May 2008 23:34:46 -0700
  Total time: 7s
  Build Trigger: Schedule
  Build Number: 57
  Exit code: 1
  Building machine hostname: vmbuild.apache.org
  Operating system : Linux(unknown)
  Java Home version : 
          java version "1.6.0_05"
          Java(TM) SE Runtime Environment (build 1.6.0_05-b13)
          Java HotSpot(TM) Client VM (build 10.0-b19, mixed mode, sharing)
        
  Builder version :
          Maven version: 2.0.7
          Java version: 1.6.0_05
          OS name: "linux" version: "2.6.20-16-server" arch: "i386"
    
****************************************************************************
SCM Changes:
****************************************************************************
Changed: no author @ no date
Comment: no comment
Files changed:
  src/main/java/org/apache/maven/continuum/core/action/UpdateWorkingDirectoryFromScmContinuumAction.java
( no revision )
  src/main/java/org/apache/maven/continuum/core/action/CheckoutProjectContinuumAction.java
( no revision )

****************************************************************************
Dependencies Changes:
****************************************************************************
No dependencies changed


****************************************************************************
Build Defintion:
****************************************************************************
POM filename: pom.xml
Goals: clean install   
Arguments: --batch-mode --non-recursive
Build Fresh: false
Always Build: false
Default Build Definition: true
Schedule: DEFAULT_SCHEDULE
Description: $build.buildDefinition.description


****************************************************************************
Test Summary:
****************************************************************************
Tests: 66
Failures: 0
Total time: 159349

****************************************************************************
Output:
****************************************************************************
[INFO] Scanning for projects...
[INFO] ------------------------------------------------------------------------
[ERROR] FATAL ERROR
[INFO] ------------------------------------------------------------------------
[INFO] Error building POM (may not be this project's POM).


Project ID: org.apache.continuum:continuum-core
POM Location: /home/continuum/data/working-directory/463/pom.xml
Validation Messages:

    [0]  'dependencies.dependency.version' is missing for org.apache.continuum:continuum-scm


Reason: Failed to validate POM for project org.apache.continuum:continuum-core at /home/continuum/data/working-directory/463/pom.xml


[INFO] ------------------------------------------------------------------------
[INFO] Trace
org.apache.maven.reactor.MavenExecutionException: Failed to validate POM for project org.apache.continuum:continuum-core
at /home/continuum/data/working-directory/463/pom.xml
	at org.apache.maven.DefaultMaven.getProjects(DefaultMaven.java:378)
	at org.apache.maven.DefaultMaven.doExecute(DefaultMaven.java:290)
	at org.apache.maven.DefaultMaven.execute(DefaultMaven.java:125)
	at org.apache.maven.cli.MavenCli.main(MavenCli.java:280)
	at sun.reflect.NativeMethodAccessorImpl.invoke0(Native Method)
	at sun.reflect.NativeMethodAccessorImpl.invoke(NativeMethodAccessorImpl.java:39)
	at sun.reflect.DelegatingMethodAccessorImpl.invoke(DelegatingMethodAccessorImpl.java:25)
	at java.lang.reflect.Method.invoke(Method.java:597)
	at org.codehaus.classworlds.Launcher.launchEnhanced(Launcher.java:315)
	at org.codehaus.classworlds.Launcher.launch(Launcher.java:255)
	at org.codehaus.classworlds.Launcher.mainWithExitCode(Launcher.java:430)
	at org.codehaus.classworlds.Launcher.main(Launcher.java:375)
Caused by: org.apache.maven.project.InvalidProjectModelException: Failed to validate POM for
project org.apache.continuum:continuum-core at /home/continuum/data/working-directory/463/pom.xml
	at org.apache.maven.project.DefaultMavenProjectBuilder.processProjectLogic(DefaultMavenProjectBuilder.java:998)
	at org.apache.maven.project.DefaultMavenProjectBuilder.buildInternal(DefaultMavenProjectBuilder.java:801)
	at org.apache.maven.project.DefaultMavenProjectBuilder.buildFromSourceFileInternal(DefaultMavenProjectBuilder.java:479)
	at org.apache.maven.project.DefaultMavenProjectBuilder.build(DefaultMavenProjectBuilder.java:200)
	at org.apache.maven.DefaultMaven.getProject(DefaultMaven.java:553)
	at org.apache.maven.DefaultMaven.collectProjects(DefaultMaven.java:467)
	at org.apache.maven.DefaultMaven.getProjects(DefaultMaven.java:364)
	... 11 more
[INFO] ------------------------------------------------------------------------
[INFO] Total time: < 1 second
[INFO] Finished at: Tue May 06 23:34:45 PDT 2008
[INFO] Final Memory: 1M/4M
[INFO] ------------------------------------------------------------------------

****************************************************************************



Mime
View raw message