continuum-notifications mailing list archives

Site index · List index
Message view « Date » · « Thread »
Top « Date » · « Thread »
From Continuum VMBuild Server <contin...@apache.org>
Subject [continuum] BUILD FAILURE: Continuum XMLRPC :: Client
Date Sat, 05 Apr 2008 00:38:12 GMT
Online report : http://vmbuild.apache.org/continuum/buildResult.action?buildId=73242&projectId=478

Build statistics:
  State: Failed
  Previous State: Ok
  Started at: Fri 4 Apr 2008 17:37:00 -0700
  Finished at: Fri 4 Apr 2008 17:37:56 -0700
  Total time: 55s
  Build Trigger: Schedule
  Build Number: 23
  Exit code: 1
  Building machine hostname: vmbuild.apache.org
  Operating system : Linux(unknown)
  Java Home version : 
          java version "1.6.0_05"
          Java(TM) SE Runtime Environment (build 1.6.0_05-b13)
          Java HotSpot(TM) Client VM (build 10.0-b19, mixed mode, sharing)
        
  Builder version :
          Maven version: 2.0.7
          Java version: 1.6.0_05
          OS name: "linux" version: "2.6.20-16-server" arch: "i386"
    
****************************************************************************
SCM Changes:
****************************************************************************
Changed: no author @ no date
Comment: no comment
Files changed:
  src/main/java/org/apache/maven/continuum/xmlrpc/client/ContinuumXmlRpcClient.java ( no revision
)

****************************************************************************
Dependencies Changes:
****************************************************************************
No dependencies changed


****************************************************************************
Build Defintion:
****************************************************************************
POM filename: pom.xml
Goals: clean install   
Arguments: --batch-mode --non-recursive
Build Fresh: false
Always Build: false
Default Build Definition: true
Schedule: DEFAULT_SCHEDULE
Description: $build.buildDefinition.description


****************************************************************************
Test Summary:
****************************************************************************
Tests: 0
Failures: 0
Total time: 0

****************************************************************************
Output:
****************************************************************************
[INFO] Scanning for projects...
[INFO] ----------------------------------------------------------------------------
[INFO] Building Continuum XMLRPC :: Client
[INFO]    task-segment: [clean, install]
[INFO] ----------------------------------------------------------------------------
[INFO] [clean:clean]
[INFO] Deleting directory /home/continuum/data/working-directory/478/target
[INFO] Deleting directory /home/continuum/data/working-directory/478/target/classes
[INFO] Deleting directory /home/continuum/data/working-directory/478/target/test-classes
[INFO] Deleting directory /home/continuum/data/working-directory/478/target/site
[INFO] [buildnumber:create {execution: default}]
[INFO] Checking for local modifications: skipped.
[INFO] Updating project files from SCM: skipped.
[INFO] Storing buildNumber: 645002 at timestamp: 1207355857116
[INFO] Setting property: classpath.resource.loader.class => 'org.codehaus.plexus.velocity.ContextClassLoaderResourceLoader'.
[INFO] Setting property: velocimacro.messages.on => 'false'.
[INFO] Setting property: resource.loader => 'classpath'.
[INFO] Setting property: resource.manager.logwhenfound => 'false'.
[INFO] [remote-resources:process {execution: default}]
[INFO] [resources:resources]
[INFO] Using default encoding to copy filtered resources.
[INFO] [compiler:compile]
[INFO] Compiling 2 source files to /home/continuum/data/working-directory/478/target/classes
[INFO] ------------------------------------------------------------------------
[ERROR] BUILD FAILURE
[INFO] ------------------------------------------------------------------------
[INFO] Compilation failure

/home/continuum/data/working-directory/478/src/main/java/org/apache/maven/continuum/xmlrpc/client/ContinuumXmlRpcClient.java:[510,24]
cannot find symbol
symbol  : method getProjectsInBuildQueue()
location: interface org.apache.maven.continuum.xmlrpc.ContinuumService

/home/continuum/data/working-directory/478/src/main/java/org/apache/maven/continuum/xmlrpc/client/ContinuumXmlRpcClient.java:[516,24]
cannot find symbol
symbol  : method isProjectInBuildingQueue(int)
location: interface org.apache.maven.continuum.xmlrpc.ContinuumService


[INFO] ------------------------------------------------------------------------
[INFO] For more information, run Maven with the -e switch
[INFO] ------------------------------------------------------------------------
[INFO] Total time: 32 seconds
[INFO] Finished at: Fri Apr 04 17:37:56 PDT 2008
[INFO] Final Memory: 13M/27M
[INFO] ------------------------------------------------------------------------

****************************************************************************



Mime
View raw message