continuum-notifications mailing list archives

Site index · List index
Message view « Date » · « Thread »
Top « Date » · « Thread »
From Continuum VMBuild Server <contin...@apache.org>
Subject [continuum] BUILD FAILURE: Continuum Reports
Date Fri, 18 Apr 2008 01:19:22 GMT
Online report : http://vmbuild.apache.org/continuum/buildResult.action?buildId=78261&projectId=462

Build statistics:
  State: Failed
  Previous State: Ok
  Started at: Thu 17 Apr 2008 18:18:42 -0700
  Finished at: Thu 17 Apr 2008 18:19:07 -0700
  Total time: 25s
  Build Trigger: Schedule
  Build Number: 42
  Exit code: 1
  Building machine hostname: vmbuild.apache.org
  Operating system : Linux(unknown)
  Java Home version : 
          java version "1.6.0_05"
          Java(TM) SE Runtime Environment (build 1.6.0_05-b13)
          Java HotSpot(TM) Client VM (build 10.0-b19, mixed mode, sharing)
        
  Builder version :
          Maven version: 2.0.7
          Java version: 1.6.0_05
          OS name: "linux" version: "2.6.20-16-server" arch: "i386"
    
****************************************************************************
SCM Changes:
****************************************************************************
Changed: no author @ no date
Comment: no comment
Files changed:
  src/test/java/org/apache/maven/continuum/reports/surefire/ConfigurationServiceMock.java
( no revision )
  src/test/resources/org/apache/maven/continuum/reports/surefire/DefaultReportTestSuiteGeneratorTest.xml
( no revision )
  pom.xml ( no revision )

****************************************************************************
Dependencies Changes:
****************************************************************************
org.apache.continuum:continuum-api:1.2-SNAPSHOT

org.apache.continuum:continuum:1.2-SNAPSHOT


****************************************************************************
Build Defintion:
****************************************************************************
POM filename: pom.xml
Goals: clean install   
Arguments: --batch-mode --non-recursive
Build Fresh: false
Always Build: false
Default Build Definition: true
Schedule: DEFAULT_SCHEDULE
Description: $build.buildDefinition.description


****************************************************************************
Test Summary:
****************************************************************************
Tests: 0
Failures: 0
Total time: 0

****************************************************************************
Output:
****************************************************************************
[INFO] Scanning for projects...
[INFO] ----------------------------------------------------------------------------
[INFO] Building Continuum Reports
[INFO]    task-segment: [clean, install]
[INFO] ----------------------------------------------------------------------------
[INFO] [clean:clean]
[INFO] Deleting directory /home/continuum/data/working-directory/462/target
[INFO] Deleting directory /home/continuum/data/working-directory/462/target/classes
[INFO] Deleting directory /home/continuum/data/working-directory/462/target/test-classes
[INFO] Deleting directory /home/continuum/data/working-directory/462/target/site
[INFO] [buildnumber:create {execution: default}]
[INFO] Checking for local modifications: skipped.
[INFO] Updating project files from SCM: skipped.
[INFO] Storing buildNumber: 649344 at timestamp: 1208481529771
[INFO] [plexus:descriptor {execution: generate}]
[INFO] snapshot org.apache.continuum:continuum-api:1.2-SNAPSHOT: checking for updates from
codehaus.org
[INFO] snapshot org.apache.continuum:continuum-api:1.2-SNAPSHOT: checking for updates from
people.apache.org
[INFO] snapshot org.apache.continuum:continuum-api:1.2-SNAPSHOT: checking for updates from
apache.snapshots
[INFO] snapshot org.apache.continuum:continuum-test:1.2-SNAPSHOT: checking for updates from
codehaus.org
[INFO] snapshot org.apache.continuum:continuum-test:1.2-SNAPSHOT: checking for updates from
people.apache.org
[INFO] snapshot org.apache.continuum:continuum-test:1.2-SNAPSHOT: checking for updates from
apache.snapshots
[WARNING] POM for 'jpox:jpox:pom:1.1.9:test' is invalid. It will be ignored for artifact resolution.
Reason: Not a v4.0.0 POM. for project jpox:jpox at /home/continuum/.m2/repository/jpox/jpox/1.1.9/jpox-1.1.9.pom
[INFO] snapshot org.codehaus.plexus:plexus-spring:1.0-SNAPSHOT: checking for updates from
codehaus.org
[INFO] snapshot org.codehaus.plexus:plexus-spring:1.0-SNAPSHOT: checking for updates from
people.apache.org
[INFO] Setting property: classpath.resource.loader.class => 'org.codehaus.plexus.velocity.ContextClassLoaderResourceLoader'.
[INFO] Setting property: velocimacro.messages.on => 'false'.
[INFO] Setting property: resource.loader => 'classpath'.
[INFO] Setting property: resource.manager.logwhenfound => 'false'.
[INFO] [remote-resources:process {execution: default}]
[INFO] [resources:resources]
[INFO] Using default encoding to copy filtered resources.
[WARNING] POM for 'jpox:jpox:pom:1.1.9:test' is invalid. It will be ignored for artifact resolution.
Reason: Not a v4.0.0 POM. for project jpox:jpox at /home/continuum/.m2/repository/jpox/jpox/1.1.9/jpox-1.1.9.pom
[INFO] [compiler:compile]
[INFO] Compiling 8 source files to /home/continuum/data/working-directory/462/target/classes
[INFO] [resources:testResources]
[INFO] Using default encoding to copy filtered resources.
[WARNING] POM for 'jpox:jpox:pom:1.1.9:test' is invalid. It will be ignored for artifact resolution.
Reason: Not a v4.0.0 POM. for project jpox:jpox at /home/continuum/.m2/repository/jpox/jpox/1.1.9/jpox-1.1.9.pom
[INFO] [compiler:testCompile]
[INFO] Compiling 2 source files to /home/continuum/data/working-directory/462/target/test-classes
[INFO] ------------------------------------------------------------------------
[ERROR] BUILD FAILURE
[INFO] ------------------------------------------------------------------------
[INFO] Compilation failure
/home/continuum/data/working-directory/462/src/test/java/org/apache/maven/continuum/reports/surefire/ConfigurationServiceMock.java:[8,52]
cannot find symbol
symbol  : class ConfigurationServiceMock
location: package org.apache.maven.continuum.configuration



/home/continuum/data/working-directory/462/src/test/java/org/apache/maven/continuum/reports/surefire/ConfigurationServiceMock.java:[8,52]
cannot find symbol
symbol  : class ConfigurationServiceMock
location: package org.apache.maven.continuum.configuration


[INFO] ------------------------------------------------------------------------
[INFO] For more information, run Maven with the -e switch
[INFO] ------------------------------------------------------------------------
[INFO] Total time: 17 seconds
[INFO] Finished at: Thu Apr 17 18:19:04 PDT 2008
[INFO] Final Memory: 21M/37M
[INFO] ------------------------------------------------------------------------

****************************************************************************



Mime
View raw message