continuum-notifications mailing list archives

Site index · List index
Message view « Date » · « Thread »
Top « Date » · « Thread »
From Continuum VMBuild Server <contin...@apache.org>
Subject [continuum] BUILD FAILURE: Continuum Release System
Date Wed, 30 Apr 2008 05:04:42 GMT
Online report : http://vmbuild.apache.org/continuum/buildResult.action?buildId=82669&projectId=480

Build statistics:
  State: Failed
  Previous State: Ok
  Started at: Tue 29 Apr 2008 22:04:09 -0700
  Finished at: Tue 29 Apr 2008 22:04:31 -0700
  Total time: 22s
  Build Trigger: Schedule
  Build Number: 50
  Exit code: 1
  Building machine hostname: vmbuild.apache.org
  Operating system : Linux(unknown)
  Java Home version : 
          java version "1.6.0_05"
          Java(TM) SE Runtime Environment (build 1.6.0_05-b13)
          Java HotSpot(TM) Client VM (build 10.0-b19, mixed mode, sharing)
        
  Builder version :
          Maven version: 2.0.7
          Java version: 1.6.0_05
          OS name: "linux" version: "2.6.20-16-server" arch: "i386"
    
****************************************************************************
SCM Changes:
****************************************************************************
No files changed

****************************************************************************
Dependencies Changes:
****************************************************************************
org.apache.continuum:continuum-api:1.2-SNAPSHOT

org.apache.continuum:continuum-commons:1.2-SNAPSHOT

org.apache.continuum:continuum-test:1.2-SNAPSHOT

org.apache.continuum:continuum:1.2-SNAPSHOT


****************************************************************************
Build Defintion:
****************************************************************************
POM filename: pom.xml
Goals: clean install   
Arguments: --batch-mode --non-recursive
Build Fresh: false
Always Build: false
Default Build Definition: true
Schedule: DEFAULT_SCHEDULE
Description: $build.buildDefinition.description


****************************************************************************
Test Summary:
****************************************************************************
Tests: 1
Failures: 1
Total time: 743

****************************************************************************
Output:
****************************************************************************
[INFO] Scanning for projects...
[INFO] ----------------------------------------------------------------------------
[INFO] Building Continuum Release System
[INFO]    task-segment: [clean, install]
[INFO] ----------------------------------------------------------------------------
[INFO] [clean:clean]
[INFO] Deleting directory /home/continuum/data/working-directory/480/target
[INFO] Deleting directory /home/continuum/data/working-directory/480/target/classes
[INFO] Deleting directory /home/continuum/data/working-directory/480/target/test-classes
[INFO] Deleting directory /home/continuum/data/working-directory/480/target/site
[INFO] [buildnumber:create {execution: default}]
[INFO] Checking for local modifications: skipped.
[INFO] Updating project files from SCM: skipped.
[INFO] Storing buildNumber: 652262 at timestamp: 1209531858271
[INFO] Setting property: classpath.resource.loader.class => 'org.codehaus.plexus.velocity.ContextClassLoaderResourceLoader'.
[INFO] Setting property: velocimacro.messages.on => 'false'.
[INFO] Setting property: resource.loader => 'classpath'.
[INFO] Setting property: resource.manager.logwhenfound => 'false'.
[INFO] [remote-resources:process {execution: default}]
[INFO] [resources:resources]
[INFO] Using default encoding to copy filtered resources.
[INFO] [compiler:compile]
[INFO] Compiling 14 source files to /home/continuum/data/working-directory/480/target/classes
[INFO] [resources:testResources]
[INFO] Using default encoding to copy filtered resources.
[INFO] [compiler:testCompile]
[INFO] Compiling 1 source file to /home/continuum/data/working-directory/480/target/test-classes
[INFO] [surefire:test]
[INFO] Surefire report directory: /home/continuum/data/working-directory/480/target/surefire-reports

-------------------------------------------------------
 T E S T S
-------------------------------------------------------
Running org.apache.maven.continuum.release.executors.ReleaseTaskExecutorTest
Tests run: 1, Failures: 0, Errors: 1, Skipped: 0, Time elapsed: 0.807 sec <<< FAILURE!

Results :

Tests in error: 
  testReleases(org.apache.maven.continuum.release.executors.ReleaseTaskExecutorTest)

Tests run: 1, Failures: 0, Errors: 1, Skipped: 0

[INFO] ------------------------------------------------------------------------
[ERROR] BUILD FAILURE
[INFO] ------------------------------------------------------------------------
[INFO] There are test failures.

Please refer to /home/continuum/data/working-directory/480/target/surefire-reports for the
individual test results.
[INFO] ------------------------------------------------------------------------
[INFO] For more information, run Maven with the -e switch
[INFO] ------------------------------------------------------------------------
[INFO] Total time: 16 seconds
[INFO] Finished at: Tue Apr 29 22:04:30 PDT 2008
[INFO] Final Memory: 23M/41M
[INFO] ------------------------------------------------------------------------

****************************************************************************



Mime
View raw message