continuum-notifications mailing list archives

Site index · List index
Message view « Date » · « Thread »
Top « Date » · « Thread »
From Continuum VMBuild Server <contin...@apache.org>
Subject [continuum] BUILD FAILURE: Continuum Wagon Notifier
Date Fri, 14 Mar 2008 00:08:14 GMT
Online report : http://vmbuild.apache.org/continuum/buildResult.action?buildId=64902&projectId=470

Build statistics:
  State: Failed
  Previous State: Failed
  Started at: Thu 13 Mar 2008 17:06:57 -0700
  Finished at: Thu 13 Mar 2008 17:07:55 -0700
  Total time: 58s
  Build Trigger: Schedule
  Build Number: 1
  Exit code: 1
  Building machine hostname: vmbuild.apache.org
  Operating system : Linux(unknown)
  Java Home version : 
          java version "1.6.0_05"
          Java(TM) SE Runtime Environment (build 1.6.0_05-b13)
          Java HotSpot(TM) Client VM (build 10.0-b19, mixed mode, sharing)
        
  Builder version :
          Maven version: 2.0.7
          Java version: 1.6.0_05
          OS name: "linux" version: "2.6.20-16-server" arch: "i386"
    
****************************************************************************
SCM Changes:
****************************************************************************
No files changed

****************************************************************************
Dependencies Changes:
****************************************************************************
org.apache.continuum:continuum-api:1.2-SNAPSHOT

org.apache.continuum:continuum-core:1.2-SNAPSHOT

org.apache.continuum:continuum-notifier-api:1.2-SNAPSHOT

org.apache.continuum:continuum-notifiers:1.2-SNAPSHOT


****************************************************************************
Build Defintion:
****************************************************************************
POM filename: pom.xml
Goals: clean install   
Arguments: --batch-mode --non-recursive
Build Fresh: false
Always Build: false
Default Build Definition: true
Schedule: DEFAULT_SCHEDULE
Description: $build.buildDefinition.description


****************************************************************************
Test Summary:
****************************************************************************
Tests: 1
Failures: 1
Total time: 12377

****************************************************************************
Output:
****************************************************************************
[INFO] Scanning for projects...
[INFO] ----------------------------------------------------------------------------
[INFO] Building Continuum Wagon Notifier
[INFO]    task-segment: [clean, install]
[INFO] ----------------------------------------------------------------------------
[INFO] [clean:clean]
[INFO] Deleting directory /home/continuum/data/working-directory/470/target
[INFO] Deleting directory /home/continuum/data/working-directory/470/target/classes
[INFO] Deleting directory /home/continuum/data/working-directory/470/target/test-classes
[INFO] Deleting directory /home/continuum/data/working-directory/470/target/site
[INFO] [plexus:descriptor {execution: default}]
[WARNING] Component: WagonContinuumNotifier, field name: 'localRepository': Currently configurable
fields will not be written to the descriptor without a default value.
[INFO] snapshot org.apache.continuum:continuum-core:1.2-SNAPSHOT: checking for updates from
codehaus.org
[INFO] snapshot org.apache.continuum:continuum-core:1.2-SNAPSHOT: checking for updates from
maven2-repository.dev.java.net
[INFO] snapshot org.apache.continuum:continuum-core:1.2-SNAPSHOT: checking for updates from
people.apache.org
[INFO] snapshot org.apache.continuum:continuum-core:1.2-SNAPSHOT: checking for updates from
apache.snapshots
[INFO] Setting property: classpath.resource.loader.class => 'org.codehaus.plexus.velocity.ContextClassLoaderResourceLoader'.
[INFO] Setting property: velocimacro.messages.on => 'false'.
[INFO] Setting property: resource.loader => 'classpath'.
[INFO] Setting property: resource.manager.logwhenfound => 'false'.
[INFO] [remote-resources:process {execution: default}]
[INFO] [resources:resources]
[INFO] Using default encoding to copy filtered resources.
[INFO] [compiler:compile]
[INFO] Compiling 1 source file to /home/continuum/data/working-directory/470/target/classes
[INFO] [resources:testResources]
[INFO] Using default encoding to copy filtered resources.
[INFO] [compiler:testCompile]
[INFO] Compiling 5 source files to /home/continuum/data/working-directory/470/target/test-classes
[INFO] [surefire:test]
[INFO] Surefire report directory: /home/continuum/data/working-directory/470/target/surefire-reports

-------------------------------------------------------
 T E S T S
-------------------------------------------------------
Running org.apache.maven.continuum.wagon.WagonContinuumNotifierTest
17:07:40.779 EVENT  Starting Jetty/4.2.12
17:07:40.999 EVENT  Started ServletHttpContext[/dav]
17:07:42.035 EVENT  Started SocketListener on 0.0.0.0:10007
17:07:42.035 EVENT  Started org.mortbay.jetty.Server@1764be1
WAGON_VERSION: 1.0-beta-2
17:07:45,613 DEBUG [httpclient.wire.header] - >> "MKCOL /dav/ HTTP/1.1[\r][\n]"
17:07:50,903 DEBUG [httpclient.wire.header] - >> "User-Agent: Jakarta Commons-HttpClient/3.1[\r][\n]"
17:07:50,903 DEBUG [httpclient.wire.header] - >> "Host: localhost:10007[\r][\n]"
17:07:50,903 DEBUG [httpclient.wire.header] - >> "[\r][\n]"
17:07:51.461 EVENT  [LOCALREPO] Initialized from /home/continuum/data/working-directory/470/target
Invalid resource: /it/could/webdav/webdav.props
Invalid resource: /it/could/webdav/mime.types
17:07:51,482 DEBUG [httpclient.wire.header] - << "HTTP/1.1 405 Method Not Allowed[\r][\n]"
17:07:51,482 DEBUG [httpclient.wire.header] - << "HTTP/1.1 405 Method Not Allowed[\r][\n]"
17:07:51,483 DEBUG [httpclient.wire.header] - << "Date: Fri, 14 Mar 2008 00:07:51 GMT[\r][\n]"
17:07:51,484 DEBUG [httpclient.wire.header] - << "Server: Jetty/4.2 null/null[\r][\n]"
17:07:51,484 DEBUG [httpclient.wire.header] - << "DAV: 1[\r][\n]"
17:07:51,484 DEBUG [httpclient.wire.header] - << "MS-Author-Via: DAV[\r][\n]"
17:07:51,484 DEBUG [httpclient.wire.header] - << "Content-Type: text/html; charset="UTF-8"[\r][\n]"
17:07:51,485 DEBUG [httpclient.wire.header] - << "Transfer-Encoding: chunked[\r][\n]"
17:07:51,485 DEBUG [httpclient.wire.header] - << "[\r][\n]"
17:07:51.539 EVENT  Stopping Acceptor ServerSocket[addr=0.0.0.0/0.0.0.0,port=0,localport=10007]
17:07:51,528 DEBUG [httpclient.wire.content] - << "5"
17:07:51,528 DEBUG [httpclient.wire.content] - << "7"
17:07:51,528 DEBUG [httpclient.wire.content] - << "f"
17:07:51,528 DEBUG [httpclient.wire.content] - << "[\r]"
17:07:51,528 DEBUG [httpclient.wire.content] - << "[\n]"
17:07:51,528 DEBUG [httpclient.wire.content] - << "<html>[\n]"
17:07:51,528 DEBUG [httpclient.wire.content] - << "<head><title>Error 405
Method Not Allowed</title></head>[\n]"
17:07:51,528 DEBUG [httpclient.wire.content] - << "<body>[\n]"
17:07:51,528 DEBUG [httpclient.wire.content] - << "<p><b>Error 405 Method
Not Allowed</b></p>[\n]"
17:07:51,529 DEBUG [httpclient.wire.content] - << "<p>Resource in error: <a
href="http://localhost:10007/dav/">[\n]"
17:07:51,529 DEBUG [httpclient.wire.content] - << "http://localhost:10007/dav/</a></p>[\n]"
17:07:51,529 DEBUG [httpclient.wire.content] - << "<hr /><p>Exception details:</p>[\n]"
17:07:51,529 DEBUG [httpclient.wire.content] - << "<pre>it.could.webdav.DAVException:
Resource exists[\n]"
17:07:51,529 DEBUG [httpclient.wire.content] - << "[0x9]at it.could.webdav.DAVResource.makeCollection(DAVResource.java:432)[\n]"
17:07:51,529 DEBUG [httpclient.wire.content] - << "[0x9]at it.could.webdav.methods.MKCOL.process(MKCOL.java:54)[\n]"
17:07:51,529 DEBUG [httpclient.wire.content] - << "[0x9]at it.could.webdav.DAVProcessor.process(DAVProcessor.java:79)[\n]"
17:07:51,529 DEBUG [httpclient.wire.content] - << "[0x9]at it.could.webdav.DAVServlet.service(DAVServlet.java:185)[\n]"
17:07:51,529 DEBUG [httpclient.wire.content] - << "[0x9]at org.mortbay.jetty.servlet.ServletHolder.handle(ServletHolder.java:356)[\n]"
17:07:51,529 DEBUG [httpclient.wire.content] - << "[0x9]at org.mortbay.jetty.servlet.ServletHandler.dispatch(ServletHandler.java:660)[\n]"
17:07:51,530 DEBUG [httpclient.wire.content] - << "[0x9]at org.mortbay.jetty.servlet.ServletHandler.handle(ServletHandler.java:567)[\n]"
17:07:51,530 DEBUG [httpclient.wire.content] - << "[0x9]at org.mortbay.http.HttpContext.handle(HttpContext.java:1723)[\n]"
17:07:51,530 DEBUG [httpclient.wire.content] - << "[0x9]at org.mortbay.http.HttpContext.handle(HttpContext.java:1673)[\n]"
17:07:51,530 DEBUG [httpclient.wire.content] - << "[0x9]at org.mortbay.http.HttpServer.service(HttpServer.java:879)[\n]"
17:07:51,530 DEBUG [httpclient.wire.content] - << "[0x9]at org.mortbay.http.HttpConnection.service(HttpConnection.java"
17:07:51,530 DEBUG [httpclient.wire.content] - << ":783)[\n]"
17:07:51,530 DEBUG [httpclient.wire.content] - << "[0x9]at org.mortbay.http.HttpConnection.handleNext(HttpConnection.java:945)[\n]"
17:07:51,530 DEBUG [httpclient.wire.content] - << "[0x9]at org.mortbay.http.HttpConnection.handle(HttpConnection.java:800)[\n]"
17:07:51,530 DEBUG [httpclient.wire.content] - << "[0x9]at org.mortbay.http.SocketListener.handleConnection(SocketListener.java:201)[\n]"
17:07:51,532 DEBUG [httpclient.wire.content] - << "[0x9]at org.mortbay.util.ThreadedServer.handle(ThreadedServer.java:289)[\n]"
17:07:51,532 DEBUG [httpclient.wire.content] - << "[0x9]at org.mortbay.util.ThreadPool$PoolThread.run(ThreadPool.java:454)[\n]"
17:07:51,532 DEBUG [httpclient.wire.content] - << "</pre>[\n]"
17:07:51,532 DEBUG [httpclient.wire.content] - << "</body>[\n]"
17:07:51,532 DEBUG [httpclient.wire.content] - << "</html>[\n]"
17:07:51,532 DEBUG [httpclient.wire.content] - << "[\r]"
17:07:51,532 DEBUG [httpclient.wire.content] - << "[\n]"
17:07:51,533 DEBUG [httpclient.wire.content] - << "0"
17:07:51,533 DEBUG [httpclient.wire.content] - << "[\r]"
17:07:51,533 DEBUG [httpclient.wire.content] - << "[\n]"
17:07:51,533 DEBUG [httpclient.wire.content] - << "[\r]"
17:07:51,533 DEBUG [httpclient.wire.content] - << "[\n]"
17:07:51,533 DEBUG [httpclient.wire.header] - << "[\r][\n]"
17:07:51.541 EVENT  Stopped SocketListener on 0.0.0.0:10007
17:07:51.542 EVENT  Stopped ServletHttpContext[/dav]
17:07:51.542 EVENT  Stopped org.mortbay.jetty.Server@1764be1
Tests run: 1, Failures: 0, Errors: 1, Skipped: 0, Time elapsed: 12.405 sec <<< FAILURE!

Results :

Tests in error: 
  testSendNotification(org.apache.maven.continuum.wagon.WagonContinuumNotifierTest)

Tests run: 1, Failures: 0, Errors: 1, Skipped: 0

[INFO] ------------------------------------------------------------------------
[ERROR] BUILD FAILURE
[INFO] ------------------------------------------------------------------------
[INFO] There are test failures.

Please refer to /home/continuum/data/working-directory/470/target/surefire-reports for the
individual test results.
[INFO] ------------------------------------------------------------------------
[INFO] For more information, run Maven with the -e switch
[INFO] ------------------------------------------------------------------------
[INFO] Total time: 46 seconds
[INFO] Finished at: Thu Mar 13 17:07:51 PDT 2008
[INFO] Final Memory: 26M/47M
[INFO] ------------------------------------------------------------------------

****************************************************************************



Mime
View raw message