continuum-notifications mailing list archives

Site index · List index
Message view « Date » · « Thread »
Top « Date » · « Thread »
From Continuum VMBuild Server <contin...@apache.org>
Subject [continuum] BUILD SUCCESSFUL: Continuum Plexus Runtime
Date Fri, 14 Mar 2008 14:14:52 GMT
Online report : http://vmbuild.apache.org/continuum/buildResult.action?buildId=65364&projectId=472

Build statistics:
  State: Ok
  Previous State: Failed
  Started at: Fri 14 Mar 2008 07:12:27 -0700
  Finished at: Fri 14 Mar 2008 07:14:29 -0700
  Total time: 2m 1s
  Build Trigger: Schedule
  Build Number: 2
  Exit code: 0
  Building machine hostname: vmbuild.apache.org
  Operating system : Linux(unknown)
  Java Home version : 
          java version "1.6.0_05"
          Java(TM) SE Runtime Environment (build 1.6.0_05-b13)
          Java HotSpot(TM) Client VM (build 10.0-b19, mixed mode, sharing)
        
  Builder version :
          Maven version: 2.0.7
          Java version: 1.6.0_05
          OS name: "linux" version: "2.6.20-16-server" arch: "i386"
    
****************************************************************************
SCM Changes:
****************************************************************************
No files changed

****************************************************************************
Dependencies Changes:
****************************************************************************
org.apache.continuum:continuum-plexus-application:1.2-SNAPSHOT

org.apache.continuum:continuum:1.2-SNAPSHOT


****************************************************************************
Build Defintion:
****************************************************************************
POM filename: pom.xml
Goals: clean install   
Arguments: --batch-mode --non-recursive
Build Fresh: false
Always Build: false
Default Build Definition: true
Schedule: DEFAULT_SCHEDULE
Description: $build.buildDefinition.description


****************************************************************************
Test Summary:
****************************************************************************
Tests: 0
Failures: 0
Total time: 0

****************************************************************************
Output:
****************************************************************************
[INFO] Scanning for projects...
[INFO] ----------------------------------------------------------------------------
[INFO] Building Continuum Plexus Runtime
[INFO]    task-segment: [clean, install]
[INFO] ----------------------------------------------------------------------------
[INFO] [clean:clean]
[INFO] Deleting directory /home/continuum/data/working-directory/472/target
[INFO] Deleting directory /home/continuum/data/working-directory/472/target/classes
[INFO] Deleting directory /home/continuum/data/working-directory/472/target/test-classes
[INFO] Deleting directory /home/continuum/data/working-directory/472/target/site
[INFO] snapshot org.apache.continuum:continuum-plexus-application:1.2-SNAPSHOT: checking for
updates from codehaus.org
[INFO] snapshot org.apache.continuum:continuum-plexus-application:1.2-SNAPSHOT: checking for
updates from maven2-repository.dev.java.net
[INFO] snapshot org.apache.continuum:continuum-plexus-application:1.2-SNAPSHOT: checking for
updates from people.apache.org
[INFO] snapshot org.apache.continuum:continuum-plexus-application:1.2-SNAPSHOT: checking for
updates from apache.snapshots
[INFO] Setting property: classpath.resource.loader.class => 'org.codehaus.plexus.velocity.ContextClassLoaderResourceLoader'.
[INFO] Setting property: velocimacro.messages.on => 'false'.
[INFO] Setting property: resource.loader => 'classpath'.
[INFO] Setting property: resource.manager.logwhenfound => 'false'.
[INFO] [remote-resources:process {execution: default}]
[INFO] [resources:resources]
[INFO] Using default encoding to copy filtered resources.
[INFO] [plexus-appserver:assemble-runtime {execution: default}]
[INFO] Building runtime in /home/continuum/data/working-directory/472/target/plexus-continuum-runtime
[INFO] Adding org.codehaus.plexus:plexus-classworlds:jar:1.2-alpha-7 to core/boot
[INFO] Adding jpox:jpox:jar:1.1.7 to core
[INFO] Adding org.codehaus.plexus:plexus-utils:jar:1.4.6 to core
[INFO] Adding directory-naming:naming-factory:jar:0.8 to core
[INFO] Adding javax.activation:activation:jar:1.1 to core
[INFO] Adding org.codehaus.plexus:plexus-component-api:jar:1.0-alpha-20 to core
[INFO] Adding javax.jdo:jdo2-api:jar:2.0 to core
[INFO] Adding org.codehaus.plexus:plexus-contextualizer:jar:1.0-alpha-1 to core
[INFO] Adding org.codehaus.plexus:plexus-appserver-host:jar:2.0-alpha-8 to core
[INFO] Adding javax.mail:mail:jar:1.4 to core
[INFO] Adding log4j:log4j:jar:1.2.12 to core
[INFO] Adding directory-naming:naming-java:jar:0.8 to core
[INFO] Adding javax.resource:connector:jar:1.0 to core
[INFO] Adding org.apache.derby:derby:jar:10.1.3.1 to core
[INFO] Adding directory-naming:naming-core:jar:0.8 to core
[INFO] Adding commons-logging:commons-logging-api:jar:1.0.4 to core
[INFO] Adding commons-dbcp:commons-dbcp:jar:1.2.1 to core
[INFO] Adding commons-collections:commons-collections:jar:2.1 to core
[INFO] Adding commons-pool:commons-pool:jar:1.2 to core
[INFO] Adding org.codehaus.plexus:plexus-naming:jar:1.0-alpha-2 to core
[INFO] Adding org.codehaus.plexus:plexus-container-default:jar:1.0-alpha-20 to core
[WARNING] org.apache.velocity.runtime.exception.ReferenceException: reference : template =
org/codehaus/plexus/builder/templates/classworlds.vm [line 4,column 6] : ${plexus.core} is
not a valid reference.
[WARNING] org.apache.velocity.runtime.exception.ReferenceException: reference : template =
org/codehaus/plexus/builder/templates/classworlds.vm [line 5,column 6] : ${tools.jar} is not
a valid reference.
[WARNING] org.apache.velocity.runtime.exception.ReferenceException: reference : template =
org/codehaus/plexus/builder/templates/plexus.vm [line 3,column 14] : $PLEXUS_OPTS is not a
valid reference.
[WARNING] org.apache.velocity.runtime.exception.ReferenceException: reference : template =
org/codehaus/plexus/builder/templates/plexus.vm [line 5,column 25] : $var is not a valid reference.
[WARNING] org.apache.velocity.runtime.exception.ReferenceException: reference : template =
org/codehaus/plexus/builder/templates/plexus.vm [line 16,column 13] : $THIS_PROG is not a
valid reference.
[WARNING] org.apache.velocity.runtime.exception.ReferenceException: reference : template =
org/codehaus/plexus/builder/templates/plexus.vm [line 17,column 15] : $THIS_PROG is not a
valid reference.
[WARNING] org.apache.velocity.runtime.exception.ReferenceException: reference : template =
org/codehaus/plexus/builder/templates/plexus.vm [line 18,column 15] : $ls is not a valid reference.
[WARNING] org.apache.velocity.runtime.exception.ReferenceException: reference : template =
org/codehaus/plexus/builder/templates/plexus.vm [line 19,column 12] : $link is not a valid
reference.
[WARNING] org.apache.velocity.runtime.exception.ReferenceException: reference : template =
org/codehaus/plexus/builder/templates/plexus.vm [line 20,column 16] : $link is not a valid
reference.
[WARNING] org.apache.velocity.runtime.exception.ReferenceException: reference : template =
org/codehaus/plexus/builder/templates/plexus.vm [line 22,column 25] : $THIS_PROG is not a
valid reference.
[WARNING] org.apache.velocity.runtime.exception.ReferenceException: reference : template =
org/codehaus/plexus/builder/templates/plexus.vm [line 22,column 39] : $link is not a valid
reference.
[WARNING] org.apache.velocity.runtime.exception.ReferenceException: reference : template =
org/codehaus/plexus/builder/templates/plexus.vm [line 27,column 18] : $THIS_PROG is not a
valid reference.
[WARNING] org.apache.velocity.runtime.exception.ReferenceException: reference : template =
org/codehaus/plexus/builder/templates/plexus.vm [line 28,column 18] : $PRGDIR is not a valid
reference.
[WARNING] org.apache.velocity.runtime.exception.ReferenceException: reference : template =
org/codehaus/plexus/builder/templates/plexus.vm [line 30,column 10] : $PLEXUS_BASE is not
a valid reference.
[WARNING] org.apache.velocity.runtime.exception.ReferenceException: reference : template =
org/codehaus/plexus/builder/templates/plexus.vm [line 31,column 15] : $PLEXUS_HOME is not
a valid reference.
[WARNING] org.apache.velocity.runtime.exception.ReferenceException: reference : template =
org/codehaus/plexus/builder/templates/plexus.vm [line 35,column 10] : $PLEXUS_TMPDIR is not
a valid reference.
[WARNING] org.apache.velocity.runtime.exception.ReferenceException: reference : template =
org/codehaus/plexus/builder/templates/plexus.vm [line 36,column 18] : $PLEXUS_BASE is not
a valid reference.
[WARNING] org.apache.velocity.runtime.exception.ReferenceException: reference : template =
org/codehaus/plexus/builder/templates/plexus.vm [line 39,column 10] : $JAVA_HOME is not a
valid reference.
[WARNING] org.apache.velocity.runtime.exception.ReferenceException: reference : template =
org/codehaus/plexus/builder/templates/plexus.vm [line 47,column 4] : $cygwin is not a valid
reference.
[WARNING] org.apache.velocity.runtime.exception.ReferenceException: reference : template =
org/codehaus/plexus/builder/templates/plexus.vm [line 48,column 9] : $PLEXUS_HOME is not a
valid reference.
[WARNING] org.apache.velocity.runtime.exception.ReferenceException: reference : template =
org/codehaus/plexus/builder/templates/plexus.vm [line 49,column 34] : $PLEXUS_HOME is not
a valid reference.
[WARNING] org.apache.velocity.runtime.exception.ReferenceException: reference : template =
org/codehaus/plexus/builder/templates/plexus.vm [line 50,column 9] : $PLEXUS_BASE is not a
valid reference.
[WARNING] org.apache.velocity.runtime.exception.ReferenceException: reference : template =
org/codehaus/plexus/builder/templates/plexus.vm [line 51,column 34] : $PLEXUS_BASE is not
a valid reference.
[WARNING] org.apache.velocity.runtime.exception.ReferenceException: reference : template =
org/codehaus/plexus/builder/templates/plexus.vm [line 52,column 9] : $PLEXUS_TMPDIR is not
a valid reference.
[WARNING] org.apache.velocity.runtime.exception.ReferenceException: reference : template =
org/codehaus/plexus/builder/templates/plexus.vm [line 53,column 36] : $PLEXUS_TMPDIR is not
a valid reference.
[WARNING] org.apache.velocity.runtime.exception.ReferenceException: reference : template =
org/codehaus/plexus/builder/templates/plexus.vm [line 54,column 9] : $JAVA_HOME is not a valid
reference.
[WARNING] org.apache.velocity.runtime.exception.ReferenceException: reference : template =
org/codehaus/plexus/builder/templates/plexus.vm [line 55,column 32] : $JAVA_HOME is not a
valid reference.
[WARNING] org.apache.velocity.runtime.exception.ReferenceException: reference : template =
org/codehaus/plexus/builder/templates/plexus.vm [line 58,column 10] : $JAVACMD is not a valid
reference.
[WARNING] org.apache.velocity.runtime.exception.ReferenceException: reference : template =
org/codehaus/plexus/builder/templates/plexus.vm [line 59,column 12] : $JAVA_HOME is not a
valid reference.
[WARNING] org.apache.velocity.runtime.exception.ReferenceException: reference : template =
org/codehaus/plexus/builder/templates/plexus.vm [line 60,column 14] : $JAVA_HOME is not a
valid reference.
[WARNING] org.apache.velocity.runtime.exception.ReferenceException: reference : template =
org/codehaus/plexus/builder/templates/plexus.vm [line 62,column 16] : $JAVA_HOME is not a
valid reference.
[WARNING] org.apache.velocity.runtime.exception.ReferenceException: reference : template =
org/codehaus/plexus/builder/templates/plexus.vm [line 64,column 16] : $JAVA_HOME is not a
valid reference.
[WARNING] org.apache.velocity.runtime.exception.ReferenceException: reference : template =
org/codehaus/plexus/builder/templates/plexus.vm [line 71,column 12] : $JAVACMD is not a valid
reference.
[WARNING] org.apache.velocity.runtime.exception.ReferenceException: reference : template =
org/codehaus/plexus/builder/templates/plexus.vm [line 73,column 29] : $JAVACMD is not a valid
reference.
[WARNING] org.apache.velocity.runtime.exception.ReferenceException: reference : template =
org/codehaus/plexus/builder/templates/plexus.vm [line 77,column 10] : $JAVA_HOME is not a
valid reference.
[WARNING] org.apache.velocity.runtime.exception.ReferenceException: reference : template =
org/codehaus/plexus/builder/templates/plexus.vm [line 85,column 4] : $cygwin is not a valid
reference.
[WARNING] org.apache.velocity.runtime.exception.ReferenceException: reference : template =
org/codehaus/plexus/builder/templates/plexus.vm [line 86,column 42] : $PLEXUS_HOME is not
a valid reference.
[WARNING] org.apache.velocity.runtime.exception.ReferenceException: reference : template =
org/codehaus/plexus/builder/templates/plexus.vm [line 87,column 42] : $PLEXUS_BASE is not
a valid reference.
[WARNING] org.apache.velocity.runtime.exception.ReferenceException: reference : template =
org/codehaus/plexus/builder/templates/plexus.vm [line 88,column 44] : $PLEXUS_TMPDIR is not
a valid reference.
[WARNING] org.apache.velocity.runtime.exception.ReferenceException: reference : template =
org/codehaus/plexus/builder/templates/plexus.vm [line 89,column 40] : $JAVA_HOME is not a
valid reference.
[WARNING] org.apache.velocity.runtime.exception.ReferenceException: reference : template =
org/codehaus/plexus/builder/templates/plexus.vm [line 93,column 12] : ${JAVA_HOME} is not
a valid reference.
[WARNING] org.apache.velocity.runtime.exception.ReferenceException: reference : template =
org/codehaus/plexus/builder/templates/plexus.vm [line 94,column 4] : $darwin is not a valid
reference.
[WARNING] org.apache.velocity.runtime.exception.ReferenceException: reference : template =
org/codehaus/plexus/builder/templates/plexus.vm [line 100,column 28] : $PLEXUS_HOME is not
a valid reference.
[WARNING] org.apache.velocity.runtime.exception.ReferenceException: reference : template =
org/codehaus/plexus/builder/templates/plexus.vm [line 101,column 28] : $PLEXUS_BASE is not
a valid reference.
[WARNING] org.apache.velocity.runtime.exception.ReferenceException: reference : template =
org/codehaus/plexus/builder/templates/plexus.vm [line 102,column 28] : $PLEXUS_TMPDIR is not
a valid reference.
[WARNING] org.apache.velocity.runtime.exception.ReferenceException: reference : template =
org/codehaus/plexus/builder/templates/plexus.vm [line 103,column 6] : $JAVA_HOME is not a
valid reference.
[WARNING] org.apache.velocity.runtime.exception.ReferenceException: reference : template =
org/codehaus/plexus/builder/templates/plexus.vm [line 104,column 30] : $JAVA_HOME is not a
valid reference.
[WARNING] org.apache.velocity.runtime.exception.ReferenceException: reference : template =
org/codehaus/plexus/builder/templates/plexus.vm [line 109,column 7] : $JAVACMD is not a valid
reference.
[WARNING] org.apache.velocity.runtime.exception.ReferenceException: reference : template =
org/codehaus/plexus/builder/templates/plexus.vm [line 110,column 3] : $PLEXUS_OPTS is not
a valid reference.
[WARNING] org.apache.velocity.runtime.exception.ReferenceException: reference : template =
org/codehaus/plexus/builder/templates/plexus.vm [line 111,column 15] : ${PLEXUS_HOME} is not
a valid reference.
[WARNING] org.apache.velocity.runtime.exception.ReferenceException: reference : template =
org/codehaus/plexus/builder/templates/plexus.vm [line 112,column 23] : ${PLEXUS_HOME} is not
a valid reference.
[WARNING] org.apache.velocity.runtime.exception.ReferenceException: reference : template =
org/codehaus/plexus/builder/templates/plexus.vm [line 113,column 18] : ${PLEXUS_HOME} is not
a valid reference.
[WARNING] org.apache.velocity.runtime.exception.ReferenceException: reference : template =
org/codehaus/plexus/builder/templates/plexus.vm [line 114,column 25] : ${PATH} is not a valid
reference.
[WARNING] org.apache.velocity.runtime.exception.ReferenceException: reference : template =
org/codehaus/plexus/builder/templates/plexus.vm [line 115,column 21] : ${PLEXUS_TMPDIR} is
not a valid reference.
[WARNING] org.apache.velocity.runtime.exception.ReferenceException: reference : template =
org/codehaus/plexus/builder/templates/plexus.vm [line 116,column 16] : $TOOLS_JAR is not a
valid reference.
[WARNING] org.apache.velocity.runtime.exception.ReferenceException: reference : template =
org/codehaus/plexus/builder/templates/plexus.vm [line 117,column 18] : ${PLEXUS_HOME} is not
a valid reference.
[WARNING] org.apache.velocity.runtime.exception.ReferenceException: reference : template =
org/codehaus/plexus/builder/templates/plexus.vm [line 118,column 21] : ${PLEXUS_BASE} is not
a valid reference.
[WARNING] org.apache.velocity.runtime.exception.ReferenceException: reference : template =
org/codehaus/plexus/builder/templates/plexus.vm [line 119,column 3] : $MAIN_CLASS is not a
valid reference.
[INFO] [plexus-appserver:add-services {execution: default}]
[INFO] [plexus-appserver:add-apps {execution: default}]
[INFO] [antrun:run {execution: config}]
[INFO] Executing tasks
     [copy] Copying 2 files to /home/continuum/data/working-directory/472/target/plexus-continuum-runtime/conf
[INFO] Executed tasks
[INFO] [compiler:compile]
[INFO] No sources to compile
[INFO] [resources:testResources]
[INFO] Using default encoding to copy filtered resources.
[INFO] [compiler:testCompile]
[INFO] No sources to compile
[INFO] [surefire:test]
[INFO] Surefire report directory: /home/continuum/data/working-directory/472/target/surefire-reports

-------------------------------------------------------
 T E S T S
-------------------------------------------------------
There are no tests to run.

Results :

Tests run: 0, Failures: 0, Errors: 0, Skipped: 0

[INFO] [jar:jar]
[INFO] Building jar: /home/continuum/data/working-directory/472/target/continuum-plexus-runtime-1.2-SNAPSHOT.jar
[WARNING] DEPRECATED [descriptor]: Please use descriptors instead
[INFO] [assembly:single {execution: default}]
[INFO] Building tar : /home/continuum/data/working-directory/472/target/apache-continuum-1.2-SNAPSHOT-bin.tar.gz
[INFO] Building tar : /home/continuum/data/working-directory/472/target/apache-continuum-1.2-SNAPSHOT-bin.tar.bz2
[INFO] Building zip: /home/continuum/data/working-directory/472/target/apache-continuum-1.2-SNAPSHOT-bin.zip
[INFO] [install:install]
[INFO] Installing /home/continuum/data/working-directory/472/target/continuum-plexus-runtime-1.2-SNAPSHOT.jar
to /home/continuum/.m2/repository/org/apache/continuum/continuum-plexus-runtime/1.2-SNAPSHOT/continuum-plexus-runtime-1.2-SNAPSHOT.jar
[INFO] Installing /home/continuum/data/working-directory/472/target/apache-continuum-1.2-SNAPSHOT-bin.tar.gz
to /home/continuum/.m2/repository/org/apache/continuum/continuum-plexus-runtime/1.2-SNAPSHOT/continuum-plexus-runtime-1.2-SNAPSHOT-bin.tar.gz
[INFO] Installing /home/continuum/data/working-directory/472/target/apache-continuum-1.2-SNAPSHOT-bin.tar.bz2
to /home/continuum/.m2/repository/org/apache/continuum/continuum-plexus-runtime/1.2-SNAPSHOT/continuum-plexus-runtime-1.2-SNAPSHOT-bin.tar.bz2
[INFO] Installing /home/continuum/data/working-directory/472/target/apache-continuum-1.2-SNAPSHOT-bin.zip
to /home/continuum/.m2/repository/org/apache/continuum/continuum-plexus-runtime/1.2-SNAPSHOT/continuum-plexus-runtime-1.2-SNAPSHOT-bin.zip
[INFO] ------------------------------------------------------------------------
[INFO] BUILD SUCCESSFUL
[INFO] ------------------------------------------------------------------------
[INFO] Total time: 1 minute 54 seconds
[INFO] Finished at: Fri Mar 14 07:14:28 PDT 2008
[INFO] Final Memory: 33M/60M
[INFO] ------------------------------------------------------------------------

****************************************************************************



Mime
View raw message