continuum-issues mailing list archives

Site index · List index
Message view « Date » · « Thread »
Top « Date » · « Thread »
From "Maria Catherine Tan (JIRA)" <j...@codehaus.org>
Subject [jira] Created: (CONTINUUM-2490) Getting permission denied when running selenium tests in IE
Date Fri, 19 Mar 2010 06:49:23 GMT
Getting permission denied when running selenium tests in IE
-----------------------------------------------------------

                 Key: CONTINUUM-2490
                 URL: http://jira.codehaus.org/browse/CONTINUUM-2490
             Project: Continuum
          Issue Type: Bug
            Reporter: Maria Catherine Tan


Running selenium tests in IE results to a permission denied, when using the waitForCondition

-------------------------------------------------------------------------------
Test set: TestSuite
-------------------------------------------------------------------------------
Tests run: 200, Failures: 5, Errors: 0, Skipped: 18, Time elapsed: 5,482.5 sec <<<
FAILURE!
testProjectGroupAllBuildSuccess(org.apache.continuum.web.test.ProjectGroupTest)  Time elapsed:
41.282 sec  <<< FAILURE!
com.thoughtworks.selenium.SeleniumException: Permission denied
    at com.thoughtworks.selenium.HttpCommandProcessor.throwAssertionFailureExceptionOrError(HttpCommandProcessor.java:97)
    at com.thoughtworks.selenium.HttpCommandProcessor.doCommand(HttpCommandProcessor.java:91)
    at com.thoughtworks.selenium.DefaultSelenium.waitForCondition(DefaultSelenium.java:627)
    at org.apache.continuum.web.test.parent.AbstractSeleniumTest.waitForCondition(AbstractSeleniumTest.java:450)
    at org.apache.continuum.web.test.parent.AbstractSeleniumTest.waitForElementPresent(AbstractSeleniumTest.java:434)
    at org.apache.continuum.web.test.parent.AbstractContinuumTest.waitForProjectUpdate(AbstractContinuumTest.java:905)
    at org.apache.continuum.web.test.parent.AbstractContinuumTest.waitForProjectBuild(AbstractContinuumTest.java:913)
    at org.apache.continuum.web.test.parent.AbstractContinuumTest.buildProjectGroup(AbstractContinuumTest.java:381)
    at org.apache.continuum.web.test.ProjectGroupTest.testProjectGroupAllBuildSuccess(ProjectGroupTest.java:141)

testBuildMaven2ProjectWithTag(org.apache.continuum.web.test.MavenTwoProjectTest)  Time elapsed:
53.766 sec  <<< FAILURE!
com.thoughtworks.selenium.SeleniumException: Permission denied
    at com.thoughtworks.selenium.HttpCommandProcessor.throwAssertionFailureExceptionOrError(HttpCommandProcessor.java:97)
    at com.thoughtworks.selenium.HttpCommandProcessor.doCommand(HttpCommandProcessor.java:91)
    at com.thoughtworks.selenium.DefaultSelenium.waitForCondition(DefaultSelenium.java:627)
    at org.apache.continuum.web.test.parent.AbstractSeleniumTest.waitForCondition(AbstractSeleniumTest.java:450)
    at org.apache.continuum.web.test.parent.AbstractSeleniumTest.waitForElementPresent(AbstractSeleniumTest.java:434)
    at org.apache.continuum.web.test.parent.AbstractContinuumTest.waitForProjectUpdate(AbstractContinuumTest.java:905)
    at org.apache.continuum.web.test.parent.AbstractContinuumTest.waitForProjectBuild(AbstractContinuumTest.java:913)
    at org.apache.continuum.web.test.parent.AbstractContinuumTest.buildProjectGroup(AbstractContinuumTest.java:381)
    at org.apache.continuum.web.test.MavenTwoProjectTest.testBuildMaven2ProjectWithTag(MavenTwoProjectTest.java:318)

testDeleteMavenTwoProject(org.apache.continuum.web.test.MavenTwoProjectTest)  Time elapsed:
68 sec  <<< FAILURE!
com.thoughtworks.selenium.SeleniumException: Permission denied
    at com.thoughtworks.selenium.HttpCommandProcessor.throwAssertionFailureExceptionOrError(HttpCommandProcessor.java:97)
    at com.thoughtworks.selenium.HttpCommandProcessor.doCommand(HttpCommandProcessor.java:91)
    at com.thoughtworks.selenium.DefaultSelenium.waitForCondition(DefaultSelenium.java:627)
    at org.apache.continuum.web.test.parent.AbstractSeleniumTest.waitForCondition(AbstractSeleniumTest.java:450)
    at org.apache.continuum.web.test.parent.AbstractSeleniumTest.waitForElementPresent(AbstractSeleniumTest.java:434)
    at org.apache.continuum.web.test.parent.AbstractContinuumTest.waitForProjectCheckout(AbstractContinuumTest.java:893)
    at org.apache.continuum.web.test.MavenTwoProjectTest.testDeleteMavenTwoProject(MavenTwoProjectTest.java:262)

testQueuePageWithProjectCurrentlyBuilding(org.apache.continuum.web.test.QueueTest)  Time elapsed:
38.86 sec  <<< FAILURE!
com.thoughtworks.selenium.SeleniumException: Permission denied
    at com.thoughtworks.selenium.HttpCommandProcessor.throwAssertionFailureExceptionOrError(HttpCommandProcessor.java:97)
    at com.thoughtworks.selenium.HttpCommandProcessor.doCommand(HttpCommandProcessor.java:91)
    at com.thoughtworks.selenium.DefaultSelenium.waitForCondition(DefaultSelenium.java:627)
    at org.apache.continuum.web.test.parent.AbstractSeleniumTest.waitForCondition(AbstractSeleniumTest.java:450)
    at org.apache.continuum.web.test.parent.AbstractSeleniumTest.waitForElementPresent(AbstractSeleniumTest.java:434)
    at org.apache.continuum.web.test.parent.AbstractSeleniumTest.waitForElementPresent(AbstractSeleniumTest.java:423)
    at org.apache.continuum.web.test.parent.AbstractBuildQueueTest.buildProjectForQueuePageTest(AbstractBuildQueueTest.java:93)
    at org.apache.continuum.web.test.QueueTest.testQueuePageWithProjectCurrentlyBuilding(QueueTest.java:133)

testContinuumGroupProjectAdmin_AddProjectToProjectGroup(org.apache.continuum.web.test.UserRolesManagementTest)
 Time elapsed: 43.547 sec  <<< FAILURE!
com.thoughtworks.selenium.SeleniumException: Permission denied
    at com.thoughtworks.selenium.HttpCommandProcessor.throwAssertionFailureExceptionOrError(HttpCommandProcessor.java:97)
    at com.thoughtworks.selenium.HttpCommandProcessor.doCommand(HttpCommandProcessor.java:91)
    at com.thoughtworks.selenium.DefaultSelenium.waitForCondition(DefaultSelenium.java:627)
    at org.apache.continuum.web.test.parent.AbstractSeleniumTest.waitForCondition(AbstractSeleniumTest.java:450)
    at org.apache.continuum.web.test.parent.AbstractSeleniumTest.waitForElementPresent(AbstractSeleniumTest.java:434)
    at org.apache.continuum.web.test.parent.AbstractContinuumTest.waitForProjectCheckout(AbstractContinuumTest.java:893)
    at org.apache.continuum.web.test.UserRolesManagementTest.testContinuumGroupProjectAdmin_AddProjectToProjectGroup(UserRolesManagementTest.java:273)



-- 
This message is automatically generated by JIRA.
-
If you think it was sent incorrectly contact one of the administrators: http://jira.codehaus.org/secure/Administrators.jspa
-
For more information on JIRA, see: http://www.atlassian.com/software/jira

        

Mime
View raw message