continuum-issues mailing list archives

Site index · List index
Message view « Date » · « Thread »
Top « Date » · « Thread »
From "Wendy Smoak (JIRA)" <j...@codehaus.org>
Subject [jira] Updated: (CONTINUUM-1882) BUILD FAILURE with spaces in project group name on Fedora 9
Date Fri, 20 Feb 2009 23:29:19 GMT

     [ http://jira.codehaus.org/browse/CONTINUUM-1882?page=com.atlassian.jira.plugin.system.issuetabpanels:all-tabpanel
]

Wendy Smoak updated CONTINUUM-1882:
-----------------------------------

    Summary: BUILD FAILURE with spaces in project group name on Fedora 9  (was: BUILD FAILURE)

> BUILD FAILURE with spaces in project group name on Fedora 9
> -----------------------------------------------------------
>
>                 Key: CONTINUUM-1882
>                 URL: http://jira.codehaus.org/browse/CONTINUUM-1882
>             Project: Continuum
>          Issue Type: Bug
>          Components: Integration - Maven 2
>    Affects Versions: 1.1
>         Environment: Fedora 9 Linux ,
> Maven2 - 2.0.4,
> JDK - 1.6_10
>            Reporter: Valery Gorbunov
>            Priority: Critical
>         Attachments: builderror.zip
>
>
> Can't run build  see screenshot in attachment.
> In build definition  goals are "clean install", but by Maven logs   Maven runs as "mvn
HopSurf ..." 

-- 
This message is automatically generated by JIRA.
-
If you think it was sent incorrectly contact one of the administrators: http://jira.codehaus.org/secure/Administrators.jspa
-
For more information on JIRA, see: http://www.atlassian.com/software/jira

        

Mime
View raw message