continuum-dev mailing list archives

Site index · List index
Message view « Date » · « Thread »
Top « Date » · « Thread »
From Carlos Sanchez <car...@apache.org>
Subject Firefox process hung in build machine Was: [continuum] BUILD FAILURE: Continuum - Continuum Webapp Test - Maven 2.0.9, Java 5
Date Sat, 11 Jul 2009 00:50:28 GMT
Is there somebody with access to the build machine that can take a
look for zombie firefox processes ?


---------- Forwarded message ----------
From: Continuum@vmbuild.apache.org <continuum@apache.org>
Date: Fri, Jul 10, 2009 at 5:45 PM
Subject: [continuum] BUILD FAILURE: Continuum - Continuum Webapp Test
- Maven 2.0.9, Java 5
To: notifications@continuum.apache.org, carlos@apache.org,
carlos@apache.org, carlos@apache.org


Online report :
http://vmbuild.apache.org/continuum/buildResult.action?buildId=198905&projectId=2284

Build statistics:
 State: Failed
 Previous State: Failed
 Started at: Fri 10 Jul 2009 17:39:19 -0700
 Finished at: Fri 10 Jul 2009 17:45:27 -0700
 Total time: 6m 8s
 Build Trigger: Schedule
 Build Number: 1
 Exit code: 1
 Building machine hostname: vmbuild.apache.org
 Operating system : Linux(unknown)
 Java Home version :
         java version "1.5.0_12"
         Java(TM) 2 Runtime Environment, Standard Edition (build 1.5.0_12-b04)
         Java HotSpot(TM) Client VM (build 1.5.0_12-b04, mixed mode, sharing)

 Builder version :
         Maven version: 2.0.9
         Java version: 1.5.0_12
         OS name: "linux" version: "2.6.24-23-server" arch: "i386"
Family: "unix"

****************************************************************************
SCM Changes:
****************************************************************************
Changed: carlos @ Fri 10 Jul 2009 17:10:02 -0700
Comment: Log selenium output to debug issues
Files changed:
 /continuum/trunk/continuum-webapp-test/pom.xml ( 793152 )

Changed: carlos @ Fri 10 Jul 2009 17:12:55 -0700
Comment: Add missing trailing slash
Files changed:
 /continuum/trunk/continuum-webapp-test/pom.xml ( 793153 )

Changed: carlos @ Fri 10 Jul 2009 17:13:06 -0700
Comment: Remove unneeded method
Files changed:
 /continuum/trunk/continuum-webapp-test/src/test/testng/org/apache/continuum/web/test/SetupSelenium.java
( 793154 )

****************************************************************************
Dependencies Changes:
****************************************************************************
No dependencies changed


****************************************************************************
Build Definition:
****************************************************************************
POM filename: pom.xml
Goals: clean install
Arguments: --batch-mode --non-recursive -U -P headless
Build Fresh: false
Always Build: false
Default Build Definition: true
Schedule: DEFAULT_SCHEDULE
Profile Name: Maven 2.0.9, Java 5
Description: Maven 2.0.9, Java 5

****************************************************************************
Test Summary:
****************************************************************************
Tests: 181
Failures: 2
Errors: 0
Success Rate: 98
Total time: 194.06

****************************************************************************
Test Failures:
****************************************************************************

TestSuite
   initializeContinuum :
 java.lang.RuntimeException
 java.lang.RuntimeException: Could not start Selenium session: Failed
to start new browser session: Error while launching browser
       at com.thoughtworks.selenium.DefaultSelenium.start(DefaultSelenium.java:89)
       at org.apache.continuum.web.test.parent.AbstractSeleniumTest.open(AbstractSeleniumTest.java:87)
       at org.apache.continuum.web.test.SetupSelenium.initializeContinuum(SetupSelenium.java:63)
Caused by: com.thoughtworks.selenium.SeleniumException: Failed to
start new browser session: Error while launching browser
       at com.thoughtworks.selenium.HttpCommandProcessor.throwAssertionFailureExceptionOrError(HttpCommandProcessor.java:97)
       at com.thoughtworks.selenium.HttpCommandProcessor.doCommand(HttpCommandProcessor.java:91)
       at com.thoughtworks.selenium.HttpCommandProcessor.getString(HttpCommandProcessor.java:262)
       at com.thoughtworks.selenium.HttpCommandProcessor.start(HttpCommandProcessor.java:223)
       at com.thoughtworks.selenium.DefaultSelenium.start(DefaultSelenium.java:81)
       ... 28 more

   initializeContinuum :
 com.thoughtworks.selenium.SeleniumException
 com.thoughtworks.selenium.SeleniumException: ERROR Server Exception:
sessionId should not be null; has this session been started yet?
       at com.thoughtworks.selenium.HttpCommandProcessor.throwAssertionFailureExceptionOrError(HttpCommandProcessor.java:97)
       at com.thoughtworks.selenium.HttpCommandProcessor.doCommand(HttpCommandProcessor.java:91)
       at com.thoughtworks.selenium.DefaultSelenium.open(DefaultSelenium.java:335)
       at org.apache.continuum.web.test.SetupSelenium.initializeContinuum(SetupSelenium.java:65)

Mime
View raw message