continuum-dev mailing list archives

Site index · List index
Message view « Date » · « Thread »
Top « Date » · « Thread »
From Wendy Smoak <wsm...@gmail.com>
Subject Selenium test failure: AddMavenTwoProjectTest - testNotAllowedProtocol
Date Fri, 17 Apr 2009 21:34:57 GMT
This isn't running in CI yet, but it's repeatable here... anyone else?

$ cd continuum-webapp-test
$ mvn clean install
...
Results :

Failed tests:
  testNotAllowedProtocol(org.apache.continuum.web.test.AddMavenTwoProjectTest)

Tests run: 54, Failures: 1, Errors: 0, Skipped: 0

[INFO] ------------------------------------------------------------------------
[ERROR] BUILD FAILURE
[INFO] ------------------------------------------------------------------------
[INFO] There are test failures.

$cat target/surefire-reports/*.txt
...
Test set: org.apache.continuum.web.test.AddMavenTwoProjectTest
-------------------------------------------------------------------------------
Tests run: 3, Failures: 1, Errors: 0, Skipped: 0, Time elapsed: 29.711
sec <<< FAILURE!
testNotAllowedProtocol(org.apache.continuum.web.test.AddMavenTwoProjectTest)
 Time elapsed: 9.602 sec  <<< FAILURE!
junit.framework.AssertionFailedError: 'POM Url' isn't present.
	at junit.framework.Assert.fail(Assert.java:47)
	at junit.framework.Assert.assertTrue(Assert.java:20)
	at org.apache.continuum.web.test.AbstractSeleniumTestCase.assertTextPresent(AbstractSeleniumTestCase.java:169)
	at org.apache.continuum.web.test.AbstractContinuumTestCase.assertAddMavenTwoProjectPage(AbstractContinuumTestCase.java:1350)
	at org.apache.continuum.web.test.AbstractContinuumTestCase.addMavenTwoProject(AbstractContinuumTestCase.java:1388)
	at org.apache.continuum.web.test.AddMavenTwoProjectTest.submitAddMavenTwoProjectPage(AddMavenTwoProjectTest.java:56)
	at org.apache.continuum.web.test.AddMavenTwoProjectTest.testNotAllowedProtocol(AddMavenTwoProjectTest.java:162)
...

-- 
Wendy

Mime
View raw message