continuum-dev mailing list archives

Site index · List index
Message view « Date » · « Thread »
Top « Date » · « Thread »
From Brett Porter <br...@apache.org>
Subject Re: [continuum] BUILD FAILURE: Continuum Store
Date Mon, 29 Oct 2007 16:21:19 GMT
sorry, my fault. killed the wrong build :D

On 30/10/2007, at 3:19 AM, Continuum@maven.zones.apache.org wrote:

> Online report : http://maven.zones.apache.org/continuum/ 
> buildResult.action?buildId=32081&projectId=113
>
> Build statistics:
>  State: Failed
>  Previous State: Ok
>  Started at: Mon 29 Oct 2007 16:18:49 +0000
>  Finished at: Mon 29 Oct 2007 16:19:55 +0000
>  Total time: 1m 5s
>  Build Trigger: Schedule
>  Build Number: 287
>  Exit code: 1
>  Building machine hostname: maven.zones.apache.org
>  Operating system : SunOS(unknown)
>  Java Home version :          java version "1.5.0_13"
>          Java(TM) 2 Runtime Environment, Standard Edition (build  
> 1.5.0_13-b05)
>          Java HotSpot(TM) Server VM (build 1.5.0_13-b05, mixed mode)
>         Builder version :
>          Maven version: 2.0.7
>          Java version: 1.5.0_13
>          OS name: "sunos" version: "5.10" arch: "x86"
>     
> ********************************************************************** 
> ******
> SCM Changes:
> ********************************************************************** 
> ******
> No files changed
>
> ********************************************************************** 
> ******
> Dependencies Changes:
> ********************************************************************** 
> ******
> org.apache.maven.continuum:continuum-test:1.1-beta-5-SNAPSHOT
>
> org.apache.maven.continuum:continuum-model:1.1-beta-5-SNAPSHOT
>
> org.apache.maven.continuum:continuum-api:1.1-beta-5-SNAPSHOT
>
> org.apache.maven.continuum:continuum-parent:1.1-beta-5-SNAPSHOT
>
>
> ********************************************************************** 
> ******
> Build Defintion:
> ********************************************************************** 
> ******
> POM filename: pom.xml
> Goals: clean install   Arguments: --batch-mode --non-recursive
> Build Fresh: false
> Always Build: false
> Default Build Definition: true
> Schedule: DEFAULT_SCHEDULE
> Profile Name: Maven 2.0.7
> Description:
>
> ********************************************************************** 
> ******
> Test Summary:
> ********************************************************************** 
> ******
> Tests: 0
> Failures: 0
> Total time: 0
>
> ********************************************************************** 
> ******
> Output:
> ********************************************************************** 
> ******
> [INFO] Scanning for projects...
> [INFO]  
> ---------------------------------------------------------------------- 
> ------
> [INFO] Building Continuum Store
> [INFO]    task-segment: [clean, install]
> [INFO]  
> ---------------------------------------------------------------------- 
> ------
> [INFO] [clean:clean]
> [INFO] Deleting directory /export/home/build/data/continuum/ 
> checkouts/113/target
> [INFO] [plexus:descriptor {execution: default}]
> [INFO] snapshot org.apache.maven.continuum:continuum-test:1.1- 
> beta-5-SNAPSHOT: checking for updates from codehaus.org
> [INFO] snapshot org.apache.maven.continuum:continuum-test:1.1- 
> beta-5-SNAPSHOT: checking for updates from apache.snapshots
> [INFO] Setting property: classpath.resource.loader.class =>  
> 'org.codehaus.plexus.velocity.ContextClassLoaderResourceLoader'.
> [INFO] Setting property: velocimacro.messages.on => 'false'.
> [INFO] Setting property: resource.loader => 'classpath'.
> [INFO] Setting property: resource.manager.logwhenfound => 'false'.
> [INFO] [remote-resources:process {execution: default}]
> [INFO] [resources:resources]
> [INFO] Using default encoding to copy filtered resources.
> [INFO] Resource directory does not exist: /export/home/build/data/ 
> continuum/checkouts/113/src/main/resources
> [INFO] Copying 1 resource
> [INFO] Copying 2 resources
> [INFO] [compiler:compile]
> [INFO] Compiling 2 source files to /export/home/build/data/ 
> continuum/checkouts/113/target/classes
> [INFO] [resources:testResources]
> [INFO] Using default encoding to copy filtered resources.
> [INFO] Copying 2 resources
> [INFO] Copying 2 resources
> [INFO] [compiler:testCompile]
> [INFO] Compiling 2 source files to /export/home/build/data/ 
> continuum/checkouts/113/target/test-classes
> [INFO] [surefire:test]
> [INFO] Surefire report directory: /export/home/build/data/continuum/ 
> checkouts/113/target/surefire-reports
>
> -------------------------------------------------------
> T E S T S
> -------------------------------------------------------
> Running org.apache.maven.continuum.store.ContinuumStoreTest
> [INFO]  
> ---------------------------------------------------------------------- 
> --
> [ERROR] BUILD FAILURE
> [INFO]  
> ---------------------------------------------------------------------- 
> --
> [INFO] There are test failures.
>
> Please refer to /export/home/build/data/continuum/checkouts/113/ 
> target/surefire-reports for the individual test results.
> [INFO]  
> ---------------------------------------------------------------------- 
> --
> [INFO] For more information, run Maven with the -e switch
> [INFO]  
> ---------------------------------------------------------------------- 
> --
> [INFO] Total time: 1 minute 3 seconds
> [INFO] Finished at: Mon Oct 29 16:19:55 GMT+00:00 2007
> [INFO] Final Memory: 15M/331M
> [INFO]  
> ---------------------------------------------------------------------- 
> --
>
> ********************************************************************** 
> ******
>

--
Brett Porter - brett@apache.org
Blog: http://www.devzuz.org/blogs/bporter/

Mime
View raw message