continuum-dev mailing list archives

Site index · List index
Message view « Date » · « Thread »
Top « Date » · « Thread »
From "Roald Bankras" <ro...@jteam.nl>
Subject RE: Building continuum
Date Tue, 02 Jan 2007 13:46:55 GMT
I have a clean checkout of the trunk, running on XP with JDK 1.5.0_06 and maven 2.0.4


Roald Bankras
Software Engineer
JTeam b.v.


-----Original Message-----
From: Jesse McConnell [mailto:jesse.mcconnell@gmail.com] 
Sent: Tuesday, January 02, 2007 2:26 PM
To: continuum-dev@maven.apache.org
Subject: Re: Building continuum

updated trunk builds cleanly for me right now...

what o/s jdk and mvn version are you using?

and are you sure you don't have local modifications

jesse

On 1/2/07, Roald Bankras <roald@jteam.nl> wrote:
> Continuum-core fails 1 testcase with 2 errors.
>
>
> ----------------------------------------------------------------------
> --------- Test set: 
> org.apache.maven.continuum.project.builder.maven.MavenTwoContinuumProj
> ectBuilderTest
> ----------------------------------------------------------------------
> --------- Tests run: 5, Failures: 2, Errors: 0, Skipped: 0, Time 
> elapsed: 10.656 sec <<< FAILURE!
> testCreateProjectsWithModules(org.apache.maven.continuum.project.builder.maven.MavenTwoContinuumProjectBuilderTest)
 Time elapsed: 1.594 sec  <<< FAILURE!
> junit.framework.AssertionFailedError: expected:<1> but was:<2>
>         at junit.framework.Assert.fail(Assert.java:47)
>         at junit.framework.Assert.failNotEquals(Assert.java:282)
>         at junit.framework.Assert.assertEquals(Assert.java:64)
>         at junit.framework.Assert.assertEquals(Assert.java:201)
>         at junit.framework.Assert.assertEquals(Assert.java:207)
>         at 
> org.apache.maven.continuum.project.builder.maven.MavenTwoContinuumProj
> ectBuilderTest.testCreateProjectsWithModules(MavenTwoContinuumProjectB
> uilderTest.java:184)
>
> testCreateProjectWithoutModules(org.apache.maven.continuum.project.builder.maven.MavenTwoContinuumProjectBuilderTest)
 Time elapsed: 1.406 sec  <<< FAILURE!
> junit.framework.AssertionFailedError: expected:<0> but was:<1>
>         at junit.framework.Assert.fail(Assert.java:47)
>         at junit.framework.Assert.failNotEquals(Assert.java:282)
>         at junit.framework.Assert.assertEquals(Assert.java:64)
>         at junit.framework.Assert.assertEquals(Assert.java:201)
>         at junit.framework.Assert.assertEquals(Assert.java:207)
>         at 
> org.apache.maven.continuum.project.builder.maven.MavenTwoContinuumProj
> ectBuilderTest.testCreateProjectWithoutModules(MavenTwoContinuumProjec
> tBuilderTest.java:274)
>
>
>
> Roald Bankras
> Software Engineer
> JTeam b.v.
>
> --
> No virus found in this outgoing message.
> Checked by AVG Free Edition.
> Version: 7.5.432 / Virus Database: 268.16.2/613 - Release Date: 
> 1/1/2007 2:50 PM
>
>


--
jesse mcconnell
jesse.mcconnell@gmail.com


-- 
No virus found in this incoming message.
Checked by AVG Free Edition.
Version: 7.5.432 / Virus Database: 268.16.2/613 - Release Date: 1/1/2007 2:50 PM
 

-- 
No virus found in this outgoing message.
Checked by AVG Free Edition.
Version: 7.5.432 / Virus Database: 268.16.2/613 - Release Date: 1/1/2007 2:50 PM
 

Mime
View raw message