continuum-dev mailing list archives

Site index · List index
Message view « Date » · « Thread »
Top « Date » · « Thread »
From "Roald Bankras" <ro...@jteam.nl>
Subject RE: Building continuum
Date Tue, 02 Jan 2007 12:44:21 GMT
Continuum-core fails 1 testcase with 2 errors.


-------------------------------------------------------------------------------
Test set: org.apache.maven.continuum.project.builder.maven.MavenTwoContinuumProjectBuilderTest
-------------------------------------------------------------------------------
Tests run: 5, Failures: 2, Errors: 0, Skipped: 0, Time elapsed: 10.656 sec <<< FAILURE!
testCreateProjectsWithModules(org.apache.maven.continuum.project.builder.maven.MavenTwoContinuumProjectBuilderTest)
 Time elapsed: 1.594 sec  <<< FAILURE!
junit.framework.AssertionFailedError: expected:<1> but was:<2>
	at junit.framework.Assert.fail(Assert.java:47)
	at junit.framework.Assert.failNotEquals(Assert.java:282)
	at junit.framework.Assert.assertEquals(Assert.java:64)
	at junit.framework.Assert.assertEquals(Assert.java:201)
	at junit.framework.Assert.assertEquals(Assert.java:207)
	at org.apache.maven.continuum.project.builder.maven.MavenTwoContinuumProjectBuilderTest.testCreateProjectsWithModules(MavenTwoContinuumProjectBuilderTest.java:184)

testCreateProjectWithoutModules(org.apache.maven.continuum.project.builder.maven.MavenTwoContinuumProjectBuilderTest)
 Time elapsed: 1.406 sec  <<< FAILURE!
junit.framework.AssertionFailedError: expected:<0> but was:<1>
	at junit.framework.Assert.fail(Assert.java:47)
	at junit.framework.Assert.failNotEquals(Assert.java:282)
	at junit.framework.Assert.assertEquals(Assert.java:64)
	at junit.framework.Assert.assertEquals(Assert.java:201)
	at junit.framework.Assert.assertEquals(Assert.java:207)
	at org.apache.maven.continuum.project.builder.maven.MavenTwoContinuumProjectBuilderTest.testCreateProjectWithoutModules(MavenTwoContinuumProjectBuilderTest.java:274)



Roald Bankras
Software Engineer
JTeam b.v.

-- 
No virus found in this outgoing message.
Checked by AVG Free Edition.
Version: 7.5.432 / Virus Database: 268.16.2/613 - Release Date: 1/1/2007 2:50 PM
 

Mime
View raw message