continuum-dev mailing list archives

Site index · List index
Message view « Date » · « Thread »
Top « Date » · « Thread »
From Continuum Build Server <contin...@ci.codehaus.org>
Subject [continuum] BUILD FAILURE: Continuum Core
Date Fri, 17 Mar 2006 04:57:08 GMT
Online report : http://ci.codehaus.org/continuum-maven/servlet/continuum/target/ProjectBuild.vm/view/ProjectBuild/id/85/buildId/54
Build statistics:
  State: Failed
  Previous State: Failed
  Started at: Thu, 16 Mar 2006 20:57:03 -0800
  Finished at: Thu, 16 Mar 2006 20:57:07 -0800
  Total time: 3s
  Build Trigger: Forced
  Exit code: 1
  Building machine hostname: cheddar.simulalabs.com
  Operating system : Linux(unknown)
  Java version : 1.5.0_03(Sun Microsystems Inc.)

Changes
      No files changed
  
****************************************************************************
Output:
****************************************************************************
[INFO] Scanning for projects...
[INFO] ----------------------------------------------------------------------------
[INFO] Building Continuum Core
[INFO]    task-segment: [clean, install]
[INFO] ----------------------------------------------------------------------------
[INFO] [clean:clean]
[INFO] Deleting directory /home/nobody/continuum-maven/working-directory/85/target
[INFO] [resources:resources]
[INFO] Using default encoding to copy filtered resources.
[WARNING] 
	Artifact junit:junit:jar:3.8.1 retains local scope 'test' overriding broader scope 'compile'
	given by a dependency. If this is not intended, modify or remove the local scope.

Downloading: http://snapshots.maven.codehaus.org/maven2/org/apache/maven/continuum/continuum-notifier-api/1.1-SNAPSHOT/continuum-notifier-api-1.1-SNAPSHOT.pom
[WARNING] Unable to get resource from repository snapshots (http://snapshots.maven.codehaus.org/maven2)
Downloading: http://cvs.apache.org/maven-snapshot-repository/org/apache/maven/continuum/continuum-notifier-api/1.1-SNAPSHOT/continuum-notifier-api-1.1-SNAPSHOT.pom
[WARNING] Unable to get resource from repository apache.snapshots (http://cvs.apache.org/maven-snapshot-repository)
[WARNING] 
  This artifact has been relocated to javax.jdo:jdo:2.0-20050809.1515.


Downloading: http://repo1.maven.org/maven2/javax/jdo/jdo/2.0-20050809.1515/jdo-2.0-20050809.1515.pom
java.io.FileNotFoundException: /home/nobody/.m2/repository/javax/jdo/jdo/2.0-20050809.1515/jdo-2.0-20050809.1515.pom.tmp
(Permission denied)
[INFO] ----------------------------------------------------------------------------
[ERROR] BUILD ERROR
[INFO] ----------------------------------------------------------------------------
[INFO] Error building POM (may not be this project's POM).


Project ID: javax.jdo:jdo

Reason: Error getting POM for 'javax.jdo:jdo' from the repository: GET request of: javax/jdo/jdo/2.0-20050809.1515/jdo-2.0-20050809.1515.pom
from central failed
  javax.jdo:jdo:2.0-20050809.1515:pom

from the specified remote repositories:
  central (http://repo1.maven.org/maven2),
  apache.snapshots (http://cvs.apache.org/maven-snapshot-repository),
  snapshots (http://snapshots.maven.codehaus.org/maven2)



[INFO] ----------------------------------------------------------------------------
[INFO] For more information, run Maven with the -e switch
[INFO] ----------------------------------------------------------------------------
[INFO] Total time: 2 seconds
	at java.io.FileOutputStream.open(Native Method)
	at java.io.FileOutputStream.<init>(FileOutputStream.java:179)
	at java.io.FileOutputStream.<init>(FileOutputStream.java:131)
	at org.apache.maven.wagon.LazyFileOutputStream.initialize(LazyFileOutputStream.java:148)
	at org.apache.maven.wagon.LazyFileOutputStream.write(LazyFileOutputStream.java:120)
	at org.apache.maven.wagon.AbstractWagon.transfer(AbstractWagon.java:299)
	at org.apache.maven.wagon.AbstractWagon.getTransfer(AbstractWagon.java:199)
	at org.apache.maven.wagon.AbstractWagon.getTransfer(AbstractWagon.java:182)
	at org.apache.maven.wagon.StreamWagon.get(StreamWagon.java:80)
	at org.apache.maven.artifact.manager.DefaultWagonManager.getRemoteFile(DefaultWagonManager.java:367)
	at org.apache.maven.artifact.manager.DefaultWagonManager.getArtifact(DefaultWagonManager.java:282)
	at org.apache.maven.artifact.manager.DefaultWagonManager.getArtifact(DefaultWagonManager.java:244)
	at org.apache.maven.artifact.resolver.DefaultArtifactResolver.resolve(DefaultArtifactResolver.java:124)
	at org.apache.maven.artifact.resolver.DefaultArtifactResolver.resolve(DefaultArtifactResolver.java:63)
	at org.apache.maven.project.DefaultMavenProjectBuilder.findModelFromRepository(DefaultMavenProjectBuilder.java:380)
	at org.apache.maven.project.DefaultMavenProjectBuilder.buildFromRepository(DefaultMavenProjectBuilder.java:346)
	at org.apache.maven.project.artifact.MavenMetadataSource.retrieve(MavenMetadataSource.java:101)
	at org.apache.maven.artifact.resolver.DefaultArtifactCollector.recurse(DefaultArtifactCollector.java:276)
[INFO] Finished at: Thu Mar 16 20:57:07 PST 2006
	at org.apache.maven.artifact.resolver.DefaultArtifactCollector.recurse(DefaultArtifactCollector.java:294)
	at org.apache.maven.artifact.resolver.DefaultArtifactCollector.collect(DefaultArtifactCollector.java:67)
	at org.apache.maven.artifact.resolver.DefaultArtifactResolver.resolveTransitively(DefaultArtifactResolver.java:223)
	at org.apache.maven.artifact.resolver.DefaultArtifactResolver.resolveTransitively(DefaultArtifactResolver.java:211)
	at org.apache.maven.artifact.resolver.DefaultArtifactResolver.resolveTransitively(DefaultArtifactResolver.java:182)
	at org.apache.maven.plugin.DefaultPluginManager.resolveTransitiveDependencies(DefaultPluginManager.java:1152)
	at org.apache.maven.plugin.DefaultPluginManager.executeMojo(DefaultPluginManager.java:353)
	at org.apache.maven.lifecycle.DefaultLifecycleExecutor.executeGoals(DefaultLifecycleExecutor.java:519)
	at org.apache.maven.lifecycle.DefaultLifecycleExecutor.executeGoalWithLifecycle(DefaultLifecycleExecutor.java:469)
	at org.apache.maven.lifecycle.DefaultLifecycleExecutor.executeGoal(DefaultLifecycleExecutor.java:448)
	at org.apache.maven.lifecycle.DefaultLifecycleExecutor.executeGoalAndHandleFailures(DefaultLifecycleExecutor.java:301)
	at org.apache.maven.lifecycle.DefaultLifecycleExecutor.executeTaskSegments(DefaultLifecycleExecutor.java:268)
	at org.apache.maven.lifecycle.DefaultLifecycleExecutor.execute(DefaultLifecycleExecutor.java:137)
	at org.apache.maven.DefaultMaven.doExecute(DefaultMaven.java:316)
	at org.apache.maven.DefaultMaven.execute(DefaultMaven.java:113)
	at org.apache.maven.cli.MavenCli.main(MavenCli.java:249)
	at sun.reflect.NativeMethodAccessorImpl.invoke0(Native Method)
	at sun.reflect.NativeMethodAccessorImpl.invoke(NativeMethodAccessorImpl.java:39)
	at sun.reflect.DelegatingMethodAccessorImpl.invoke(DelegatingMethodAccessorImpl.java:25)
	at java.lang.reflect.Method.invoke(Method.java:585)
	at org.codehaus.classworlds.Launcher.launchEnhanced(Launcher.java:315)
	at org.codehaus.classworlds.Launcher.launch(Launcher.java:255)
	at org.codehaus.classworlds.Launcher.mainWithExitCode(Launcher.java:430)
	at org.codehaus.classworlds.Launcher.main(Launcher.java:375)
[INFO] Final Memory: 5M/98M
[INFO] ----------------------------------------------------------------------------

****************************************************************************



Mime
View raw message