continuum-dev mailing list archives

Site index · List index
Message view « Date » · « Thread »
Top « Date » · « Thread »
From Continuum Build Server <contin...@ci.codehaus.org>
Subject [continuum] BUILD FAILURE: Continuum Model
Date Fri, 17 Mar 2006 04:53:27 GMT
Online report : http://ci.codehaus.org/continuum-maven/servlet/continuum/target/ProjectBuild.vm/view/ProjectBuild/id/86/buildId/37
Build statistics:
  State: Failed
  Previous State: Error
  Started at: Thu, 16 Mar 2006 20:52:41 -0800
  Finished at: Thu, 16 Mar 2006 20:53:25 -0800
  Total time: 43s
  Build Trigger: Forced
  Exit code: 1
  Building machine hostname: cheddar.simulalabs.com
  Operating system : Linux(unknown)
  Java version : 1.5.0_03(Sun Microsystems Inc.)

Changes
                            86/src/main/mdo/continuum.mdo
            86/src/main/java/org/apache/maven/continuum/project/ContinuumProjectState.java
            86/pom.xml
        
****************************************************************************
Output:
****************************************************************************
[INFO] Scanning for projects...
[INFO] ----------------------------------------------------------------------------
[INFO] Building Continuum Model
[INFO]    task-segment: [clean, install]
[INFO] ----------------------------------------------------------------------------
Downloading: http://repo1.maven.org/maven2/org/codehaus/modello/modello-maven-plugin/1.0-alpha-5/modello-maven-plugin-1.0-alpha-5.pom
9K downloaded
Downloading: http://repo1.maven.org/maven2/org/codehaus/modello/modello-maven-plugin/1.0-alpha-5/modello-maven-plugin-1.0-alpha-5.jar
11K downloaded
Downloading: http://repo1.maven.org/maven2/org/codehaus/mojo/maven-jpox-plugin/1.0.1/maven-jpox-plugin-1.0.1.pom
1K downloaded
Downloading: http://repo1.maven.org/maven2/org/codehaus/mojo/mojo/2/mojo-2.pom
4K downloaded
Downloading: http://repo1.maven.org/maven2/org/codehaus/mojo/maven-jpox-plugin/1.0.1/maven-jpox-plugin-1.0.1.jar
6K downloaded
[INFO] [clean:clean]
Downloading: http://repo1.maven.org/maven2/org/codehaus/modello/modello-plugin-xsd/1.0-alpha-5/modello-plugin-xsd-1.0-alpha-5.pom
8K downloaded
Downloading: http://repo1.maven.org/maven2/org/codehaus/modello/modello-core/1.0-alpha-5/modello-core-1.0-alpha-5.pom
7K downloaded
Downloading: http://repo1.maven.org/maven2/plexus/plexus-utils/1.0-alpha-3/plexus-utils-1.0-alpha-3.pom
319b downloaded
Downloading: http://repo1.maven.org/maven2/plexus/plexus-container-default/1.0-alpha-4/plexus-container-default-1.0-alpha-4.pom
806b downloaded
Downloading: http://repo1.maven.org/maven2/org/codehaus/modello/modello-plugin-xml/1.0-alpha-5/modello-plugin-xml-1.0-alpha-5.pom
7K downloaded
Downloading: http://repo1.maven.org/maven2/org/codehaus/modello/modello-plugin-jpox/1.0-alpha-5/modello-plugin-jpox-1.0-alpha-5.pom
9K downloaded
Downloading: http://repo1.maven.org/maven2/plexus/plexus-velocity/1.1/plexus-velocity-1.1.pom
914b downloaded
Downloading: http://repo1.maven.org/maven2/plexus/plexus-components/1.1/plexus-components-1.1.pom
1K downloaded
Downloading: http://repo1.maven.org/maven2/org/codehaus/modello/modello-plugin-store/1.0-alpha-5/modello-plugin-store-1.0-alpha-5.pom
8K downloaded
Downloading: http://repo1.maven.org/maven2/org/apache/maven/maven-model/2.0-alpha-3/maven-model-2.0-alpha-3.pom
1K downloaded
Downloading: http://repo1.maven.org/maven2/org/apache/maven/maven/2.0-alpha-3/maven-2.0-alpha-3.pom
4K downloaded
Downloading: http://repo1.maven.org/maven2/org/codehaus/modello/modello-plugin-xdoc/1.0-alpha-5/modello-plugin-xdoc-1.0-alpha-5.pom
8K downloaded
Downloading: http://repo1.maven.org/maven2/org/codehaus/modello/modello-plugin-xpp3/1.0-alpha-5/modello-plugin-xpp3-1.0-alpha-5.pom
8K downloaded
Downloading: http://repo1.maven.org/maven2/org/codehaus/modello/modello-plugin-prevayler/1.0-alpha-5/modello-plugin-prevayler-1.0-alpha-5.pom
9K downloaded
Downloading: http://repo1.maven.org/maven2/org/apache/maven/maven-plugin-api/2.0-alpha-3/maven-plugin-api-2.0-alpha-3.pom
532b downloaded
Downloading: http://repo1.maven.org/maven2/org/apache/maven/maven-artifact/2.0-alpha-3/maven-artifact-2.0-alpha-3.pom
702b downloaded
Downloading: http://repo1.maven.org/maven2/org/apache/maven/maven-project/2.0-alpha-3/maven-project-2.0-alpha-3.pom
1K downloaded
Downloading: http://repo1.maven.org/maven2/org/codehaus/modello/modello-plugin-xdoc/1.0-alpha-5/modello-plugin-xdoc-1.0-alpha-5.jar
7K downloaded
Downloading: http://repo1.maven.org/maven2/org/codehaus/modello/modello-core/1.0-alpha-5/modello-core-1.0-alpha-5.jar
154K downloaded
Downloading: http://repo1.maven.org/maven2/org/codehaus/modello/modello-plugin-jpox/1.0-alpha-5/modello-plugin-jpox-1.0-alpha-5.jar
18K downloaded
Downloading: http://repo1.maven.org/maven2/org/codehaus/modello/modello-plugin-store/1.0-alpha-5/modello-plugin-store-1.0-alpha-5.jar
15K downloaded
Downloading: http://repo1.maven.org/maven2/org/codehaus/modello/modello-plugin-prevayler/1.0-alpha-5/modello-plugin-prevayler-1.0-alpha-5.jar
6K downloaded
Downloading: http://repo1.maven.org/maven2/org/codehaus/modello/modello-plugin-xpp3/1.0-alpha-5/modello-plugin-xpp3-1.0-alpha-5.jar
21K downloaded
Downloading: http://repo1.maven.org/maven2/org/codehaus/modello/modello-plugin-xsd/1.0-alpha-5/modello-plugin-xsd-1.0-alpha-5.jar
8K downloaded
Downloading: http://repo1.maven.org/maven2/org/codehaus/modello/modello-plugin-xml/1.0-alpha-5/modello-plugin-xml-1.0-alpha-5.jar
9K downloaded
Downloading: http://repo1.maven.org/maven2/plexus/plexus-velocity/1.1/plexus-velocity-1.1.jar
7K downloaded
Downloading: http://repo1.maven.org/maven2/classworlds/classworlds/1.1-alpha-1/classworlds-1.1-alpha-1.jar
36K downloaded
Downloading: http://repo1.maven.org/maven2/plexus/plexus-utils/1.0-alpha-3/plexus-utils-1.0-alpha-3.jar
152K downloaded
Downloading: http://repo1.maven.org/maven2/plexus/plexus-container-default/1.0-alpha-4/plexus-container-default-1.0-alpha-4.jar
180K downloaded
[INFO] Setting property: classpath.resource.loader.class => 'org.codehaus.plexus.velocity.ContextClassLoaderResourceLoader'.
[INFO] Setting property: resource.loader => 'classpath'.
[INFO] ************************************************************** 
[INFO] Starting Jakarta Velocity v1.4
[INFO] RuntimeInstance initializing.
[INFO] Default Properties File: org/apache/velocity/runtime/defaults/velocity.properties
[INFO] Default ResourceManager initializing. (class org.apache.velocity.runtime.resource.ResourceManagerImpl)
[INFO] Resource Loader Instantiated: org.codehaus.plexus.velocity.ContextClassLoaderResourceLoader
[INFO] ClasspathResourceLoader : initialization starting.
[INFO] ClasspathResourceLoader : initialization complete.
[INFO] ResourceCache : initialized. (class org.apache.velocity.runtime.resource.ResourceCacheImpl)
[INFO] Default ResourceManager initialization complete.
[INFO] Loaded System Directive: org.apache.velocity.runtime.directive.Literal
[INFO] Loaded System Directive: org.apache.velocity.runtime.directive.Macro
[INFO] Loaded System Directive: org.apache.velocity.runtime.directive.Parse
[INFO] Loaded System Directive: org.apache.velocity.runtime.directive.Include
[INFO] Loaded System Directive: org.apache.velocity.runtime.directive.Foreach
[INFO] Created: 20 parsers.
[INFO] Velocimacro : initialization starting.
[INFO] Velocimacro : adding VMs from VM library template : VM_global_library.vm
[ERROR] ResourceManager : unable to find resource 'VM_global_library.vm' in any resource loader.
[INFO] Velocimacro : error using  VM library template VM_global_library.vm : org.apache.velocity.exception.ResourceNotFoundException:
Unable to find resource 'VM_global_library.vm'
[INFO] Velocimacro :  VM library template macro registration complete.
[INFO] Velocimacro : allowInline = true : VMs can be defined inline in templates
[INFO] Velocimacro : allowInlineToOverride = false : VMs defined inline may NOT replace previous
VM definitions
[INFO] Velocimacro : allowInlineLocal = false : VMs defined inline will be  global in scope
if allowed.
[INFO] Velocimacro : messages on  : VM system will output logging messages
[INFO] Velocimacro : autoload off  : VM system will not automatically reload global library
macros
[INFO] Velocimacro : initialization complete.
[INFO] Velocity successfully started.
[INFO] [modello:java {execution: default}]
[INFO] outputDirectory: /home/nobody/continuum-maven/working-directory/86/target/generated-sources
[INFO] [modello:jpox-jdo-mapping {execution: default}]
[INFO] outputDirectory: /home/nobody/continuum-maven/working-directory/86/target/classes
[INFO] [resources:resources]
[INFO] Using default encoding to copy filtered resources.
[WARNING] 
	Artifact junit:junit:jar:3.8.1 retains local scope 'test' overriding broader scope 'compile'
	given by a dependency. If this is not intended, modify or remove the local scope.

[INFO] [compiler:compile]
Compiling 19 source files to /home/nobody/continuum-maven/working-directory/86/target/classes
Downloading: http://repo1.maven.org/maven2/jpox/jpox-enhancer/1.1.0-beta-4/jpox-enhancer-1.1.0-beta-4.pom
1K downloaded
Downloading: http://repo1.maven.org/maven2/bcel/bcel/5.1/bcel-5.1.pom
269b downloaded
Downloading: http://repo1.maven.org/maven2/javax/jdo/jdo/2.0-20050809.1515/jdo-2.0-20050809.1515.pom
java.io.FileNotFoundException: /home/nobody/.m2/repository/javax/jdo/jdo/2.0-20050809.1515/jdo-2.0-20050809.1515.pom.tmp
(Permission denied)
	at java.io.FileOutputStream.open(Native Method)
	at java.io.FileOutputStream.<init>(FileOutputStream.java:179)
	at java.io.FileOutputStream.<init>(FileOutputStream.java:131)
	at org.apache.maven.wagon.LazyFileOutputStream.initialize(LazyFileOutputStream.java:148)
	at org.apache.maven.wagon.LazyFileOutputStream.write(LazyFileOutputStream.java:120)
	at org.apache.maven.wagon.AbstractWagon.transfer(AbstractWagon.java:299)
	at org.apache.maven.wagon.AbstractWagon.getTransfer(AbstractWagon.java:199)
	at org.apache.maven.wagon.AbstractWagon.getTransfer(AbstractWagon.java:182)
	at org.apache.maven.wagon.StreamWagon.get(StreamWagon.java:80)
	at org.apache.maven.artifact.manager.DefaultWagonManager.getRemoteFile(DefaultWagonManager.java:367)
	at org.apache.maven.artifact.manager.DefaultWagonManager.getArtifact(DefaultWagonManager.java:282)
	at org.apache.maven.artifact.manager.DefaultWagonManager.getArtifact(DefaultWagonManager.java:244)
	at org.apache.maven.artifact.resolver.DefaultArtifactResolver.resolve(DefaultArtifactResolver.java:124)
	at org.apache.maven.artifact.resolver.DefaultArtifactResolver.resolve(DefaultArtifactResolver.java:63)
	at org.apache.maven.project.DefaultMavenProjectBuilder.findModelFromRepository(DefaultMavenProjectBuilder.java:380)
	at org.apache.maven.project.DefaultMavenProjectBuilder.buildFromRepository(DefaultMavenProjectBuilder.java:346)
	at org.apache.maven.project.artifact.MavenMetadataSource.retrieve(MavenMetadataSource.java:101)
	at org.apache.maven.artifact.resolver.DefaultArtifactCollector.recurse(DefaultArtifactCollector.java:276)
	at org.apache.maven.artifact.resolver.DefaultArtifactCollector.recurse(DefaultArtifactCollector.java:294)
	at org.apache.maven.artifact.resolver.DefaultArtifactCollector.collect(DefaultArtifactCollector.java:67)
	at org.apache.maven.artifact.resolver.DefaultArtifactResolver.resolveTransitively(DefaultArtifactResolver.java:223)
	at org.apache.maven.artifact.resolver.DefaultArtifactResolver.resolveTransitively(DefaultArtifactResolver.java:211)
	at org.apache.maven.artifact.resolver.DefaultArtifactResolver.resolveTransitively(DefaultArtifactResolver.java:182)
	at org.apache.maven.plugin.DefaultPluginManager.ensurePluginContainerIsComplete(DefaultPluginManager.java:596)
	at org.apache.maven.plugin.DefaultPluginManager.getConfiguredMojo(DefaultPluginManager.java:506)
	at org.apache.maven.plugin.DefaultPluginManager.executeMojo(DefaultPluginManager.java:377)
	at org.apache.maven.lifecycle.DefaultLifecycleExecutor.executeGoals(DefaultLifecycleExecutor.java:519)
	at org.apache.maven.lifecycle.DefaultLifecycleExecutor.executeGoalWithLifecycle(DefaultLifecycleExecutor.java:469)
	at org.apache.maven.lifecycle.DefaultLifecycleExecutor.executeGoal(DefaultLifecycleExecutor.java:448)
	at org.apache.maven.lifecycle.DefaultLifecycleExecutor.executeGoalAndHandleFailures(DefaultLifecycleExecutor.java:301)
	at org.apache.maven.lifecycle.DefaultLifecycleExecutor.executeTaskSegments(DefaultLifecycleExecutor.java:268)
	at org.apache.maven.lifecycle.DefaultLifecycleExecutor.execute(DefaultLifecycleExecutor.java:137)
	at org.apache.maven.DefaultMaven.doExecute(DefaultMaven.java:316)
	at org.apache.maven.DefaultMaven.execute(DefaultMaven.java:113)
	at org.apache.maven.cli.MavenCli.main(MavenCli.java:249)
	at sun.reflect.NativeMethodAccessorImpl.invoke0(Native Method)
	at sun.reflect.NativeMethodAccessorImpl.invoke(NativeMethodAccessorImpl.java:39)
	at sun.reflect.DelegatingMethodAccessorImpl.invoke(DelegatingMethodAccessorImpl.java:25)
	at java.lang.reflect.Method.invoke(Method.java:585)
	at org.codehaus.classworlds.Launcher.launchEnhanced(Launcher.java:315)
	at org.codehaus.classworlds.Launcher.launch(Launcher.java:255)
	at org.codehaus.classworlds.Launcher.mainWithExitCode(Launcher.java:430)
	at org.codehaus.classworlds.Launcher.main(Launcher.java:375)
[INFO] ----------------------------------------------------------------------------
[ERROR] BUILD ERROR
[INFO] ----------------------------------------------------------------------------
[INFO] Error building POM (may not be this project's POM).


Project ID: javax.jdo:jdo

Reason: Error getting POM for 'javax.jdo:jdo' from the repository: GET request of: javax/jdo/jdo/2.0-20050809.1515/jdo-2.0-20050809.1515.pom
from central failed
  javax.jdo:jdo:2.0-20050809.1515:pom

from the specified remote repositories:
  central (http://repo1.maven.org/maven2),
  snapshots (http://snapshots.maven.codehaus.org/maven2)



[INFO] ----------------------------------------------------------------------------
[INFO] For more information, run Maven with the -e switch
[INFO] ----------------------------------------------------------------------------
[INFO] Total time: 41 seconds
[INFO] Finished at: Thu Mar 16 20:53:25 PST 2006
[INFO] Final Memory: 11M/140M
[INFO] ----------------------------------------------------------------------------

****************************************************************************



Mime
View raw message